program: Orca
programVersion: 5.0.2
elementType: N H C C H H O C C O N H H H C C O H O H N H H H C H H C C C C H C H C H H O H
charge: 1
multiplicity: 1
keywords: wB97X-D3BJ Opt Freq def2-TZVPP def2/J RIJCOSX VeryTightSCF
keywords: PAL8 defgrid3 VeryTightOpt
frequency: 0.00 0.00 0.00 0.00 0.00 0.00 16.95 47.04 50.35 58.44 79.04 84.30 90.23 101.07 126.58 145.14 169.13 188.29 229.54 250.51 272.12 284.33 306.94 326.84 336.27 339.66 387.67 394.46 408.94 428.31 436.57 465.96 479.04 520.69 564.79 573.41 586.94 613.18 649.45 658.84 687.39 723.09 736.33 749.42 770.67 786.13 799.94 807.13 854.27 879.46 884.41 889.05 925.89 953.04 960.06 985.37 1016.04 1021.67 1023.85 1040.47 1043.60 1081.10 1097.67 1132.44 1151.77 1181.33 1183.16 1207.60 1223.97 1242.42 1255.21 1275.54 1294.15 1315.58 1325.14 1337.62 1348.43 1353.45 1370.73 1376.13 1385.13 1389.85 1412.58 1429.34 1467.56 1481.41 1494.77 1499.37 1506.93 1534.29 1581.73 1596.08 1634.27 1669.40 1672.35 1701.31 1759.74 1775.67 1893.21 3007.78 3061.67 3070.22 3104.61 3113.32 3153.60 3160.98 3183.64 3191.41 3195.12 3202.57 3234.61 3504.07 3544.53 3568.54 3653.54 3679.21 3876.47
frequency: 16.95 47.04 50.35 58.44 79.04 84.30 90.23 101.07 126.58 145.14 169.13 188.29 229.54 250.51 272.12 284.33 306.94 326.84 336.27 339.66 387.67 394.46 408.94 428.31 436.57 465.96 479.04 520.69 564.79 573.41 586.94 613.18 649.45 658.84 687.39 723.09 736.33 749.42 770.67 786.13 799.94 807.13 854.27 879.46 884.41 889.05 925.89 953.04 960.06 985.37 1016.04 1021.67 1023.85 1040.47 1043.60 1081.10 1097.67 1132.44 1151.77 1181.33 1183.16 1207.60 1223.97 1242.42 1255.21 1275.54 1294.15 1315.58 1325.14 1337.62 1348.43 1353.45 1370.73 1376.13 1385.13 1389.85 1412.58 1429.34 1467.56 1481.41 1494.77 1499.37 1506.93 1534.29 1581.73 1596.08 1634.27 1669.40 1672.35 1701.31 1759.74 1775.67 1893.21 3007.78 3061.67 3070.22 3104.61 3113.32 3153.60 3160.98 3183.64 3191.41 3195.12 3202.57 3234.61 3504.07 3544.53 3568.54 3653.54 3679.21 3876.47
formula: C13H18N3O5
InChI: InChI=1S/C13H18N3O5/c14-10(5-8-1-3-9(17)4-2-8)13(21)16-6-11(18)15-7-12(19)20/h1-4,10,15-17,19H,5-7H2,14H3
39 atoms
N  -3.199556 -1.430122 0.749402
H  -2.968457 -2.402685 0.641573
C  -4.538636 -1.082754 1.216016
C  -4.610264 -0.828685 2.72654
H  -4.871241 -0.189764 0.68262
H  -5.211533 -1.903944 0.985484
O  -5.323425 -1.459879 3.447671
C  -2.248125 -0.507313 0.557867
C  -0.939332 -1.009378 -0.049231
O  -2.39774 0.681845 0.812435
N  0.019535 0.073862 0.03497
H  -1.130609 -1.285029 -1.091129
H  -0.602529 -1.88788 0.498277
H  -0.40056 0.991498 0.150446
C  1.34514 0.028184 0.050012
C  2.088882 -1.326562 0.045711
O  2.065533 1.025275 0.084961
H  1.603774 -2.090981 -0.558881
O  -3.821076 0.158763 3.177075
H  -3.376987 0.604732 2.436296
N  3.40689 -0.957009 -0.581652
H  3.420009 -1.078401 -1.592647
H  3.456989 0.072725 -0.364334
H  4.190357 -1.463542 -0.174424
C  2.36735 -1.823311 1.476451
H  2.910002 -1.035632 2.007567
H  3.021895 -2.697727 1.410154
C  1.105082 -2.17938 2.216383
C  0.414532 -1.211157 2.948126
C  0.565444 -3.457521 2.123549
C  -0.800097 -1.497135 3.541105
H  0.828958 -0.213528 3.050731
C  -0.65336 -3.763491 2.716794
H  1.097109 -4.234644 1.582882
C  -1.34316 -2.778442 3.421716
H  -1.347214 -0.751741 4.104271
H  -1.056293 -4.76853 2.647992
O  -2.542611 -2.986732 4.004611
H  -2.800973 -3.911167 3.962536
totalener: -1047.11670131 hartree
nucrepener: 1816.65095077 hartree
electener: -2863.76765209 hartree
oneelecener: -5016.89479042 hartree
twoeener: 2153.12713833 hartree
kineticenergy: 1041.96941041 hartree
exchangeener: -91.585940530352 hartree
correlationener: -6.620147584391 hartree
xcener: -98.206088114743 hartree
temp: 298.15 k
press: 1.00 atm
thermalcorrenthalpy: 0.00094421 hartree
totalenthalpy: -1046.86403754 hartree
totalentropycorr: -0.06298021 hartree
gibbsenthalpy: -1046.92701774 hartree
gibbsminuselec: 0.27764706 hartree
totalenthalpy: -1046.86563047 hartree
chargesum: 1.0000000
charge: -0.179898 0.185717 -0.131949 0.281188 0.146895 0.135520 -0.266205 0.292866 -0.127722 -0.420978 -0.138976 0.170129 0.102274 0.214507 0.200480 -0.004546 -0.354942 0.159861 -0.251624 0.229093 -0.061758 0.232413 0.238026 0.230126 -0.193523 0.154221 0.117683 -0.005636 -0.161769 -0.181776 -0.087175 0.143493 -0.145016 0.127571 0.098412 0.164710 0.124173 -0.251687 0.215824
charge: 0.342608 -0.015348 -0.029981 -0.457555 0.035915 0.036063 0.145064 -0.379861 -0.025861 0.100091 0.367097 0.030340 0.025633 0.004126 -0.378491 -0.031354 0.111735 0.031721 0.373327 -0.137303 0.608746 0.048485 0.010871 0.044570 -0.005387 0.044126 0.035031 -0.115407 0.005768 -0.011248 0.011050 0.031834 -0.026031 0.025420 -0.203314 0.035434 0.022126 0.390880 -0.100923
qa: -0.1799 0.1857 -0.1319 0.2812 0.1469 0.1355 -0.2662 0.2929 -0.1277 -0.4210 -0.1390 0.1701 0.1023 0.2145 0.2005 -0.0045 -0.3549 0.1599 -0.2516 0.2291 -0.0618 0.2324 0.2380 0.2301 -0.1935 0.1542 0.1177 -0.0056 -0.1618 -0.1818 -0.0872 0.1435 -0.1450 0.1276 0.0984 0.1647 0.1242 -0.2517 0.2158
va: 3.2267 1.0091 3.8247 4.3117 0.9987 1.0116 2.2337 4.2024 3.8934 2.0778 3.2307 0.9876 1.0131 1.0247 4.2974 3.8303 2.1672 0.9950 2.1901 1.0517 3.6184 0.9772 1.0414 0.9772 3.8547 1.0053 1.0076 3.6240 3.9918 4.0070 3.8776 1.0026 3.9114 1.0063 4.0904 1.0119 1.0092 2.2309 1.0279
dispcorr: -0.088139661 hartree
energy: -1047.210930742993
dipole: 12.79665 -7.47121 5.32544 -5.94399 3.82303 -2.12096 -8.43806 4.12315 -4.31491
magnitude: 7.17476 au
magnitude: 18.23680 debye
zeropoint: 0.32430293 hartree
thermalvibcorrection: 0.01720877 hartree
thermalrotcorrection: 0.00141627 hartree
thermaltrasncorrection: 0.00141627 hartree
thermaltotal: -1046.86658650 hartree
thermalcorr: 0.02004132 hartree
nonthermalcorr: 0.32430293 hartree
totalcorr: 0.34434425 hartree
totalenthalpy: -1046.86564229 hartree
