program: Orca
programVersion: 5.0.2
elementType: N H C C H H O C C O N H H H C C O H O H N H H H C H H C C C C H C H C H H O H
charge: 1
multiplicity: 1
keywords: wB97X-D3BJ Opt Freq def2-TZVPP def2/J RIJCOSX VeryTightSCF
keywords: PAL8 defgrid3 VeryTightOpt
frequency: 0.00 0.00 0.00 0.00 0.00 0.00 25.75 29.19 43.97 53.88 60.28 70.90 92.43 96.00 125.23 153.34 173.31 204.78 218.70 246.93 269.20 321.26 330.68 371.54 372.16 382.15 390.73 422.98 430.02 438.84 448.63 460.70 496.54 511.14 529.16 541.76 560.18 582.69 603.62 624.40 651.42 659.97 683.19 724.46 740.09 750.91 826.36 839.33 859.04 866.10 877.90 887.49 911.31 914.81 952.59 975.15 995.82 1014.81 1044.28 1046.99 1055.14 1100.29 1122.86 1135.49 1145.04 1176.41 1192.68 1194.42 1209.71 1237.79 1249.50 1263.13 1288.02 1317.70 1319.55 1323.14 1340.17 1348.86 1371.87 1373.39 1383.25 1393.37 1413.65 1443.34 1476.40 1491.74 1498.91 1508.25 1516.16 1580.20 1583.19 1595.94 1666.36 1676.01 1698.53 1706.09 1744.93 1792.20 1909.69 2408.09 3076.08 3095.56 3118.75 3128.74 3151.14 3161.59 3173.96 3185.03 3187.89 3209.77 3235.50 3496.61 3560.75 3630.69 3673.48 3862.73 3877.75
frequency: 25.75 29.19 43.97 53.88 60.28 70.90 92.43 96.00 125.23 153.34 173.31 204.78 218.70 246.93 269.20 321.26 330.68 371.54 372.16 382.15 390.73 422.98 430.02 438.84 448.63 460.70 496.54 511.14 529.16 541.76 560.18 582.69 603.62 624.40 651.42 659.97 683.19 724.46 740.09 750.91 826.36 839.33 859.04 866.10 877.90 887.49 911.31 914.81 952.59 975.15 995.82 1014.81 1044.28 1046.99 1055.14 1100.29 1122.86 1135.49 1145.04 1176.41 1192.68 1194.42 1209.71 1237.79 1249.50 1263.13 1288.02 1317.70 1319.55 1323.14 1340.17 1348.86 1371.87 1373.39 1383.25 1393.37 1413.65 1443.34 1476.40 1491.74 1498.91 1508.25 1516.16 1580.20 1583.19 1595.94 1666.36 1676.01 1698.53 1706.09 1744.93 1792.20 1909.69 2408.09 3076.08 3095.56 3118.75 3128.74 3151.14 3161.59 3173.96 3185.03 3187.89 3209.77 3235.50 3496.61 3560.75 3630.69 3673.48 3862.73 3877.75
formula: C13H18N3O5
InChI: InChI=1S/C13H18N3O5/c14-10(5-8-1-3-9(17)4-2-8)13(21)16-6-11(18)15-7-12(19)20/h1-4,10,15-17,19H,5-7H2,14H3
39 atoms
N  -2.415724 -1.656633 -1.741863
H  -3.024088 -0.907169 -1.458565
C  -2.625817 -2.305295 -3.035638
C  -2.628692 -3.835767 -2.965229
H  -3.589078 -1.976719 -3.427772
H  -1.842875 -2.025264 -3.73744
O  -2.175993 -4.503653 -3.840369
C  -1.287916 -1.882567 -1.059153
C  -1.022883 -1.086895 0.217037
O  -0.479444 -2.731754 -1.438089
N  -0.034973 -0.039395 0.038525
H  -0.738306 -1.795697 0.997459
H  -1.936187 -0.607062 0.567775
H  -0.393254 0.903849 0.053059
C  1.334319 -0.003833 -0.013016
C  2.273526 -1.219185 -0.106565
O  1.897606 1.067275 -0.022886
H  2.960516 -1.107723 0.733231
O  -3.209296 -4.385812 -1.879423
H  -3.567668 -3.709307 -1.297319
N  1.656722 -2.582742 0.010998
H  2.346845 -3.280841 -0.26331
H  1.380154 -2.795298 0.966592
H  0.797314 -2.703058 -0.638357
C  3.068051 -1.14596 -1.423684
H  3.831095 -1.93023 -1.404182
H  3.591367 -0.19132 -1.412899
C  2.199915 -1.280025 -2.651079
C  2.035462 -2.508404 -3.290013
C  1.519933 -0.174865 -3.158233
C  1.200283 -2.649068 -4.385042
H  2.58331 -3.379455 -2.940802
C  0.68315 -0.29712 -4.257694
H  1.658555 0.799494 -2.702782
C  0.52064 -1.536969 -4.872222
H  1.066944 -3.604343 -4.876084
H  0.17518 0.576723 -4.653544
O  -0.300939 -1.721161 -5.939599
H  -0.570138 -0.874236 -6.304131
totalener: -1047.10293944 hartree
nucrepener: 1848.36589057 hartree
electener: -2895.46883001 hartree
oneelecener: -5080.09982619 hartree
twoeener: 2184.63099618 hartree
kineticenergy: 1041.96708489 hartree
exchangeener: -91.578803283372 hartree
correlationener: -6.616448582071 hartree
xcener: -98.195251865443 hartree
temp: 298.15 k
press: 1.00 atm
thermalcorrenthalpy: 0.00094421 hartree
totalenthalpy: -1046.85070903 hartree
totalentropycorr: -0.06302795 hartree
gibbsenthalpy: -1046.91373698 hartree
gibbsminuselec: 0.27740691 hartree
totalenthalpy: -1046.85226052 hartree
chargesum: 1.0000000
charge: -0.216807 0.202136 -0.059201 0.267130 0.149763 0.116374 -0.249771 0.329112 -0.189288 -0.358969 -0.158316 0.136277 0.131260 0.198208 0.142790 0.032210 -0.289743 0.164622 -0.215033 0.200716 -0.095010 0.221554 0.210985 0.220313 -0.229709 0.129817 0.160252 0.098248 -0.220380 -0.236916 -0.047478 0.112957 -0.101860 0.154623 0.088508 0.146606 0.116323 -0.276172 0.213866
charge: 0.341993 -0.013740 -0.024892 -0.448884 0.037288 0.039736 0.166286 -0.349477 -0.048111 0.207456 0.319817 0.027633 0.038229 -0.002981 -0.380517 -0.048078 0.134937 0.045645 0.379992 -0.117255 0.587928 0.043639 0.030673 -0.078541 0.003925 0.034240 0.050733 -0.109647 -0.008591 0.000527 0.011370 0.020271 -0.026344 0.030434 -0.205964 0.034448 0.020057 0.363291 -0.107525
qa: -0.2168 0.2021 -0.0592 0.2671 0.1498 0.1164 -0.2498 0.3291 -0.1893 -0.3590 -0.1583 0.1363 0.1313 0.1982 0.1428 0.0322 -0.2897 0.1646 -0.2150 0.2007 -0.0950 0.2216 0.2110 0.2203 -0.2297 0.1298 0.1603 0.0982 -0.2204 -0.2369 -0.0475 0.1130 -0.1019 0.1546 0.0885 0.1466 0.1163 -0.2762 0.2139
va: 3.2055 0.9952 3.7858 4.3634 0.9912 1.0483 2.2531 4.0280 3.9240 2.1452 3.0337 0.9971 1.0077 1.0129 4.3678 3.7516 2.2288 1.0063 2.2230 1.0389 3.5438 0.9840 0.9849 1.1185 3.8930 1.0027 1.0139 3.4839 4.0381 4.0302 3.9452 1.0062 3.8462 1.0086 4.1120 1.0085 1.0060 2.2037 1.0284
dispcorr: -0.088041114 hartree
energy: -1047.196729087133
dipole: 3.64318 -4.15693 -0.51375 3.00819 -1.97861 1.02957 6.52082 -3.06311 3.45772
magnitude: 3.64414 au
magnitude: 9.26267 debye
zeropoint: 0.32346009 hartree
thermalvibcorrection: 0.01722572 hartree
thermalrotcorrection: 0.00141627 hartree
thermaltrasncorrection: 0.00141627 hartree
thermaltotal: -1046.85321073 hartree
thermalcorr: 0.02005826 hartree
nonthermalcorr: 0.32346009 hartree
totalcorr: 0.34351836 hartree
totalenthalpy: -1046.85226652 hartree
