program: Orca
programVersion: 5.0.2
elementType: N H C C H H O C C O N H H H C C O H O H N H H H C H H C C C C H C H C H H O H
charge: 1
multiplicity: 1
keywords: wB97X-D3BJ Opt Freq def2-TZVPP def2/J RIJCOSX VeryTightSCF
keywords: PAL8 defgrid3 VeryTightOpt
frequency: 0.00 0.00 0.00 0.00 0.00 0.00 29.49 36.28 51.84 60.67 69.80 83.74 97.66 122.58 137.46 166.36 186.01 213.97 225.90 256.68 277.53 305.43 328.77 332.49 353.24 379.72 383.60 403.65 429.00 430.67 440.78 484.34 491.95 502.92 542.27 543.36 565.52 582.15 592.93 614.36 659.25 671.79 684.61 729.07 748.50 754.00 760.80 830.60 864.44 870.09 883.41 887.71 909.75 914.32 959.61 996.10 1006.06 1019.04 1042.32 1058.41 1060.24 1077.97 1126.46 1135.17 1143.88 1183.41 1198.04 1208.72 1209.32 1238.56 1252.72 1270.79 1307.63 1310.58 1316.22 1325.33 1327.03 1343.19 1372.85 1390.36 1408.56 1416.06 1427.13 1433.98 1471.16 1488.53 1492.30 1499.13 1515.72 1553.69 1579.10 1580.98 1658.06 1672.19 1693.78 1702.10 1768.35 1805.04 1850.43 3083.68 3095.86 3100.40 3102.99 3140.73 3144.02 3151.09 3154.05 3178.68 3192.04 3207.63 3229.83 3401.17 3540.68 3636.78 3657.18 3838.68 3875.34
frequency: 29.49 36.28 51.84 60.67 69.80 83.74 97.66 122.58 137.46 166.36 186.01 213.97 225.90 256.68 277.53 305.43 328.77 332.49 353.24 379.72 383.60 403.65 429.00 430.67 440.78 484.34 491.95 502.92 542.27 543.36 565.52 582.15 592.93 614.36 659.25 671.79 684.61 729.07 748.50 754.00 760.80 830.60 864.44 870.09 883.41 887.71 909.75 914.32 959.61 996.10 1006.06 1019.04 1042.32 1058.41 1060.24 1077.97 1126.46 1135.17 1143.88 1183.41 1198.04 1208.72 1209.32 1238.56 1252.72 1270.79 1307.63 1310.58 1316.22 1325.33 1327.03 1343.19 1372.85 1390.36 1408.56 1416.06 1427.13 1433.98 1471.16 1488.53 1492.30 1499.13 1515.72 1553.69 1579.10 1580.98 1658.06 1672.19 1693.78 1702.10 1768.35 1805.04 1850.43 3083.68 3095.86 3100.40 3102.99 3140.73 3144.02 3151.09 3154.05 3178.68 3192.04 3207.63 3229.83 3401.17 3540.68 3636.78 3657.18 3838.68 3875.34
formula: C13H18N3O5
InChI: InChI=1S/C13H18N3O5/c14-10(5-8-1-3-9(17)4-2-8)13(21)16-6-11(18)15-7-12(19)20/h1-4,10,15-17,19H,5-7H2,14H3
39 atoms
N  -2.433123 -2.764355 0.533734
H  -2.772117 -2.783764 -0.414419
C  -2.581141 -3.963026 1.320673
C  -1.343074 -4.857145 1.195238
H  -2.718219 -3.706788 2.373116
H  -3.463385 -4.511604 0.987288
O  -0.395851 -4.584628 0.502445
C  -1.41124 -1.92908 0.823668
C  -0.960193 -1.038676 -0.32847
O  -0.833256 -1.959449 1.902783
N  -0.004444 -0.021234 0.034418
H  -1.831428 -0.552327 -0.770478
H  -0.564786 -1.6952 -1.107821
H  -0.35509 0.92281 0.092033
C  1.360874 -0.028087 -0.039278
C  2.19628 -1.319063 0.0193
O  1.993721 1.001043 -0.103115
H  3.033843 -1.044184 0.659237
O  -1.355064 -5.978174 1.911209
H  -2.162885 -6.076569 2.427813
N  1.519061 -2.474682 0.696044
H  2.205185 -3.082095 1.139575
H  0.828207 -2.165958 1.413051
H  0.982725 -3.06669 0.051399
C  2.720835 -1.732102 -1.363819
H  3.390141 -2.588649 -1.245282
H  3.324395 -0.900016 -1.726534
C  1.600953 -2.045752 -2.322143
C  1.044619 -3.323397 -2.394601
C  1.034115 -1.033564 -3.09581
C  -0.07032 -3.581243 -3.178015
H  1.493243 -4.14772 -1.847051
C  -0.072963 -1.278098 -3.893244
H  1.460311 -0.036256 -3.070956
C  -0.637061 -2.553528 -3.927507
H  -0.494423 -4.575553 -3.238859
H  -0.495373 -0.480279 -4.495362
O  -1.73166 -2.854301 -4.669841
H  -1.972225 -2.112945 -5.231643
totalener: -1047.12578458 hartree
nucrepener: 1831.76856552 hartree
electener: -2878.89435010 hartree
oneelecener: -5046.71239030 hartree
twoeener: 2167.81804020 hartree
kineticenergy: 1041.99284820 hartree
exchangeener: -91.592723021677 hartree
correlationener: -6.619932837644 hartree
xcener: -98.212655859320 hartree
temp: 298.15 k
press: 1.00 atm
thermalcorrenthalpy: 0.00094421 hartree
totalenthalpy: -1046.87327023 hartree
totalentropycorr: -0.06282394 hartree
gibbsenthalpy: -1046.93609417 hartree
gibbsminuselec: 0.27875146 hartree
chargesum: 1.0000000
charge: -0.172851 0.185846 -0.137981 0.345629 0.150425 0.157938 -0.356575 0.235785 -0.107666 -0.375327 -0.157536 0.163061 0.072629 0.192443 0.111109 0.039725 -0.280597 0.165473 -0.202705 0.229455 -0.042327 0.229343 0.228960 0.185178 -0.210644 0.130727 0.149472 0.029659 -0.168830 -0.204536 -0.146919 0.145688 -0.115981 0.152327 0.173065 0.142717 0.121063 -0.278001 0.220757
charge: 0.336681 -0.010112 -0.049111 -0.422837 0.042345 0.038463 0.107649 -0.374709 -0.053569 0.116203 0.329159 0.041635 0.034595 -0.002713 -0.385176 -0.043929 0.130228 0.049229 0.410523 -0.083541 0.605853 0.048794 -0.006399 0.021465 0.004970 0.036981 0.052497 -0.113836 -0.020190 0.007194 -0.004325 0.024704 -0.014967 0.034295 -0.202206 0.030530 0.023755 0.362685 -0.102817
qa: -0.1729 0.1858 -0.1380 0.3456 0.1504 0.1579 -0.3566 0.2358 -0.1077 -0.3753 -0.1575 0.1631 0.0726 0.1924 0.1111 0.0397 -0.2806 0.1655 -0.2027 0.2295 -0.0423 0.2293 0.2290 0.1852 -0.2106 0.1307 0.1495 0.0297 -0.1688 -0.2045 -0.1469 0.1457 -0.1160 0.1523 0.1731 0.1427 0.1211 -0.2780 0.2208
va: 3.2109 1.0111 3.8504 4.2286 1.0036 0.9921 2.0982 4.1980 3.8253 2.1177 3.0858 1.0001 1.0541 1.0172 4.4191 3.7519 2.2444 1.0105 2.2879 1.0150 3.6165 0.9753 1.0544 1.0679 3.8996 1.0032 1.0133 3.5492 3.9380 4.0260 3.9712 1.0075 3.8701 1.0078 4.0661 1.0121 1.0061 2.2196 1.0229
dispcorr: -0.089609903 hartree
energy: -1047.220399873728
dipole: 0.74478 -2.06546 -1.32068 -0.61104 -0.36411 -0.97515 -1.09990 1.91513 0.81523
magnitude: 1.83295 au
magnitude: 4.65899 debye
zeropoint: 0.32468122 hartree
thermalvibcorrection: 0.01706251 hartree
thermalrotcorrection: 0.00141627 hartree
thermaltrasncorrection: 0.00141627 hartree
thermaltotal: -1046.87582360 hartree
thermalcorr: 0.01989505 hartree
nonthermalcorr: 0.32468122 hartree
totalcorr: 0.34457627 hartree
totalenthalpy: -1046.87487939 hartree
