program: Orca
programVersion: 5.0.2
elementType: N H C C H H O C C O N H H H C C O H O H N H H H C H H C C C C H C H C H H O H
charge: 1
multiplicity: 1
keywords: wB97X-D3BJ Opt Freq def2-TZVPP def2/J RIJCOSX VeryTightSCF
keywords: PAL8 defgrid3 VeryTightOpt
frequency: 0.00 0.00 0.00 0.00 0.00 0.00 10.87 30.34 37.50 41.96 48.60 63.31 75.74 83.36 103.27 107.22 172.35 200.16 222.27 239.49 282.54 298.16 319.25 334.86 346.97 377.99 387.63 420.07 424.95 431.54 434.31 449.80 501.46 509.10 534.81 554.66 574.97 616.99 623.85 651.36 659.78 660.04 673.54 724.30 742.34 750.43 767.43 832.91 855.00 858.75 871.45 892.54 899.13 926.20 967.00 975.96 995.20 1031.87 1042.95 1055.70 1056.93 1111.76 1124.40 1140.44 1148.82 1169.88 1192.81 1197.93 1210.30 1224.24 1252.45 1264.02 1283.73 1308.57 1313.88 1332.23 1344.79 1365.76 1373.11 1377.43 1392.62 1398.64 1401.06 1438.81 1462.78 1482.15 1490.76 1500.17 1506.57 1541.03 1579.57 1581.43 1600.27 1668.64 1674.56 1700.46 1777.15 1799.89 1881.78 2988.67 3095.67 3099.97 3122.25 3131.23 3148.16 3171.09 3174.79 3188.36 3203.46 3216.43 3233.74 3353.50 3574.18 3627.08 3680.29 3800.86 3877.37
frequency: 10.87 30.34 37.50 41.96 48.60 63.31 75.74 83.36 103.27 107.22 172.35 200.16 222.27 239.49 282.54 298.16 319.25 334.86 346.97 377.99 387.63 420.07 424.95 431.54 434.31 449.80 501.46 509.10 534.81 554.66 574.97 616.99 623.85 651.36 659.78 660.04 673.54 724.30 742.34 750.43 767.43 832.91 855.00 858.75 871.45 892.54 899.13 926.20 967.00 975.96 995.20 1031.87 1042.95 1055.70 1056.93 1111.76 1124.40 1140.44 1148.82 1169.88 1192.81 1197.93 1210.30 1224.24 1252.45 1264.02 1283.73 1308.57 1313.88 1332.23 1344.79 1365.76 1373.11 1377.43 1392.62 1398.64 1401.06 1438.81 1462.78 1482.15 1490.76 1500.17 1506.57 1541.03 1579.57 1581.43 1600.27 1668.64 1674.56 1700.46 1777.15 1799.89 1881.78 2988.67 3095.67 3099.97 3122.25 3131.23 3148.16 3171.09 3174.79 3188.36 3203.46 3216.43 3233.74 3353.50 3574.18 3627.08 3680.29 3800.86 3877.37
formula: C13H18N3O5
InChI: InChI=1S/C13H18N3O5/c14-10(5-8-1-3-9(17)4-2-8)13(21)16-6-11(18)15-7-12(19)20/h1-4,10,15-17,19H,5-7H2,14H3
39 atoms
N  -2.291717 -2.233812 1.777494
H  -2.700342 -2.687601 0.979088
C  -2.597568 -2.734027 3.099678
C  -1.567474 -3.690727 3.681006
H  -2.689211 -1.906418 3.801715
H  -3.553729 -3.256737 3.075762
O  -1.588702 -4.058141 4.818516
C  -1.269056 -1.370978 1.606302
C  -0.899627 -1.072731 0.14696
O  -0.651458 -0.870933 2.525425
N  -0.001078 0.052431 0.048242
H  -1.796798 -0.858903 -0.436883
H  -0.445891 -1.964113 -0.288905
H  -0.394565 0.968528 0.209216
C  1.335041 0.05379 0.002763
C  2.105275 -1.278425 -0.140499
O  1.994079 1.087991 0.003648
H  1.735557 -1.814491 -1.014884
O  -0.646402 -4.108506 2.781805
H  -0.073776 -4.726411 3.256072
N  3.504309 -0.820216 -0.428008
H  3.861071 -1.113862 -1.332216
H  3.413215 0.228279 -0.373904
H  4.130902 -1.124364 0.3276
C  2.109597 -2.198196 1.102727
H  1.094835 -2.296538 1.479792
H  2.432935 -3.190153 0.779314
C  3.026766 -1.687464 2.186211
C  2.65001 -0.61676 3.004291
C  4.294372 -2.241075 2.355397
C  3.51763 -0.11395 3.953114
H  1.656316 -0.194038 2.91148
C  5.177302 -1.742239 3.307401
H  4.595318 -3.099598 1.760347
C  4.789086 -0.672495 4.107697
H  3.227754 0.707147 4.596458
H  6.1544 -2.195589 3.43517
O  5.587272 -0.132259 5.05562
H  6.422041 -0.604759 5.108015
totalener: -1047.12866052 hartree
nucrepener: 1736.18350115 hartree
electener: -2783.31216167 hartree
oneelecener: -4856.90843943 hartree
twoeener: 2073.59627777 hartree
kineticenergy: 1041.98083425 hartree
exchangeener: -91.585845872108 hartree
correlationener: -6.614304213739 hartree
xcener: -98.200150085847 hartree
temp: 298.15 k
press: 1.00 atm
thermalcorrenthalpy: 0.00094421 hartree
totalenthalpy: -1046.87058569 hartree
totalentropycorr: -0.06405975 hartree
gibbsenthalpy: -1046.93464544 hartree
gibbsminuselec: 0.27689552 hartree
totalenthalpy: -1046.87250640 hartree
chargesum: 1.0000000
charge: -0.202992 0.179773 -0.063934 0.293350 0.144108 0.132807 -0.274193 0.263464 -0.146571 -0.366096 -0.142470 0.160950 0.121349 0.208293 0.212393 -0.036571 -0.341348 0.149902 -0.292514 0.231376 -0.053834 0.227434 0.228117 0.225162 -0.135206 0.106232 0.136906 -0.000210 -0.146982 -0.272968 -0.113789 0.138390 -0.127985 0.157139 0.188139 0.144930 0.118071 -0.266740 0.216118
charge: 0.329865 -0.019635 -0.032495 -0.431830 0.046430 0.040963 0.142540 -0.410424 -0.042211 0.102498 0.360226 0.036100 0.031691 0.010979 -0.362127 -0.032711 0.130749 0.032605 0.340034 -0.087912 0.613843 0.036426 -0.002571 0.034376 0.002187 0.035346 0.036529 -0.117429 0.014977 -0.028437 0.019845 0.028716 -0.019197 0.022441 -0.188444 0.033866 0.021349 0.373034 -0.102194
qa: -0.2030 0.1798 -0.0639 0.2933 0.1441 0.1328 -0.2742 0.2635 -0.1466 -0.3661 -0.1425 0.1609 0.1213 0.2083 0.2124 -0.0366 -0.3413 0.1499 -0.2925 0.2314 -0.0538 0.2274 0.2281 0.2252 -0.1352 0.1062 0.1369 -0.0002 -0.1470 -0.2730 -0.1138 0.1384 -0.1280 0.1571 0.1881 0.1449 0.1181 -0.2667 0.2161
va: 3.1931 1.0133 3.8148 4.2821 1.0178 1.0012 2.2370 4.1782 3.8638 2.1290 3.2668 0.9925 0.9964 1.0050 4.2811 3.9056 2.1718 0.9961 2.1497 1.0235 3.5975 0.9789 1.0500 1.0191 3.8408 1.0445 1.0018 3.5711 4.0271 4.0044 3.9843 1.0366 3.9620 1.0001 4.0965 1.0079 1.0061 2.2351 1.0263
dispcorr: -0.084006056 hartree
energy: -1047.217530753999
dipole: 3.03035 -1.93620 1.09414 -2.63722 1.75264 -0.88458 -9.47164 5.12235 -4.34928
magnitude: 4.57120 au
magnitude: 11.61907 debye
zeropoint: 0.32362071 hartree
thermalvibcorrection: 0.01761605 hartree
thermalrotcorrection: 0.00141627 hartree
thermaltrasncorrection: 0.00141627 hartree
thermaltotal: -1046.87346145 hartree
thermalcorr: 0.02044860 hartree
nonthermalcorr: 0.32362071 hartree
totalcorr: 0.34406930 hartree
totalenthalpy: -1046.87251724 hartree
