program: Orca
programVersion: 5.0.2
elementType: N H C C H H O C C O N H H H C C O H O H N H H H C H H C C C C H C H C H H O H
charge: 1
multiplicity: 1
keywords: wB97X-D3BJ Opt Freq def2-TZVPP def2/J RIJCOSX VeryTightSCF
keywords: PAL8 defgrid3 VeryTightOpt
frequency: 0.00 0.00 0.00 0.00 0.00 0.00 13.03 29.70 38.13 42.82 63.19 64.93 69.03 81.95 110.01 142.83 171.08 189.53 198.61 225.46 282.39 303.62 317.40 325.64 339.21 359.20 365.74 384.18 427.71 431.25 434.30 454.05 495.55 514.54 537.00 569.50 578.59 592.64 618.85 654.05 659.23 669.43 678.93 743.03 762.11 795.67 799.79 841.77 857.13 871.78 889.19 892.23 911.56 951.68 980.28 985.79 1007.50 1011.50 1022.94 1041.98 1073.22 1093.38 1138.86 1148.49 1152.48 1159.68 1196.08 1204.23 1206.14 1245.51 1258.81 1261.97 1269.33 1292.61 1303.46 1315.40 1332.45 1343.10 1366.72 1371.21 1398.02 1399.64 1440.42 1458.45 1475.15 1494.39 1495.62 1502.63 1503.29 1515.69 1580.46 1595.16 1622.63 1672.16 1676.79 1701.50 1740.76 1801.94 1882.46 3075.88 3091.79 3096.01 3116.44 3142.46 3158.80 3182.72 3183.62 3185.76 3204.11 3230.57 3337.21 3440.43 3483.39 3586.35 3623.13 3852.73 3877.15
frequency: 13.03 29.70 38.13 42.82 63.19 64.93 69.03 81.95 110.01 142.83 171.08 189.53 198.61 225.46 282.39 303.62 317.40 325.64 339.21 359.20 365.74 384.18 427.71 431.25 434.30 454.05 495.55 514.54 537.00 569.50 578.59 592.64 618.85 654.05 659.23 669.43 678.93 743.03 762.11 795.67 799.79 841.77 857.13 871.78 889.19 892.23 911.56 951.68 980.28 985.79 1007.50 1011.50 1022.94 1041.98 1073.22 1093.38 1138.86 1148.49 1152.48 1159.68 1196.08 1204.23 1206.14 1245.51 1258.81 1261.97 1269.33 1292.61 1303.46 1315.40 1332.45 1343.10 1366.72 1371.21 1398.02 1399.64 1440.42 1458.45 1475.15 1494.39 1495.62 1502.63 1503.29 1515.69 1580.46 1595.16 1622.63 1672.16 1676.79 1701.50 1740.76 1801.94 1882.46 3075.88 3091.79 3096.01 3116.44 3142.46 3158.80 3182.72 3183.62 3185.76 3204.11 3230.57 3337.21 3440.43 3483.39 3586.35 3623.13 3852.73 3877.15
formula: C13H18N3O5
InChI: InChI=1S/C13H18N3O5/c14-10(5-8-1-3-9(17)4-2-8)13(21)16-6-11(18)15-7-12(19)20/h1-4,10,15-17,19H,5-7H2,14H3
39 atoms
N  -1.462342 -1.986496 -2.586932
H  -2.282187 -2.409429 -2.170223
C  -1.411632 -2.06688 -4.029141
C  -2.660832 -2.812998 -4.485757
H  -1.387265 -1.068186 -4.474143
H  -0.51718 -2.601575 -4.361042
O  -3.470196 -3.230844 -3.707678
C  -0.517686 -1.394423 -1.860259
C  -0.70436 -1.459209 -0.338249
O  0.470575 -0.853398 -2.35935
N  -0.243854 -0.255761 0.322094
H  -0.169861 -2.338665 0.028341
H  -1.751863 -1.606797 -0.079214
H  -0.934549 0.462438 0.487529
C  1.014652 0.237918 0.249368
C  2.178515 -0.718176 -0.028996
O  1.287479 1.411049 0.41597
H  1.872655 -1.711071 -0.344464
O  -2.801745 -2.9774 -5.803104
H  -2.078271 -2.581282 -6.299868
N  2.861896 -0.099997 -1.208359
H  3.785444 -0.517943 -1.344414
H  2.242377 -0.240885 -2.018932
H  2.956888 0.903331 -1.024059
C  3.150981 -0.796252 1.151907
H  2.643823 -1.324638 1.962036
H  3.357169 0.21571 1.504909
C  4.425084 -1.499786 0.750481
C  5.593844 -0.781264 0.514847
C  4.448302 -2.883306 0.551024
C  6.756482 -1.415321 0.090706
H  5.613215 0.290429 0.689485
C  5.595426 -3.528423 0.130447
H  3.557456 -3.472102 0.748482
C  6.759618 -2.793084 -0.102721
H  7.660847 -0.839036 -0.073017
H  5.618805 -4.601815 -0.009426
O  7.851296 -3.480685 -0.50979
H  8.608094 -2.895441 -0.597193
totalener: -1047.13312626 hartree
nucrepener: 1639.60800983 hartree
electener: -2686.74113609 hartree
oneelecener: -4663.17667188 hartree
twoeener: 1976.43553579 hartree
kineticenergy: 1041.97729041 hartree
exchangeener: -91.588826829903 hartree
correlationener: -6.612729687079 hartree
xcener: -98.201556516982 hartree
temp: 298.15 k
press: 1.00 atm
thermalcorrenthalpy: 0.00094421 hartree
totalenthalpy: -1046.87197165 hartree
totalentropycorr: -0.06447507 hartree
gibbsenthalpy: -1046.93644672 hartree
gibbsminuselec: 0.27759711 hartree
totalenthalpy: -1046.87790268 hartree
chargesum: 1.0000000
charge: -0.166096 0.190229 -0.128177 0.326052 0.136166 0.131493 -0.293445 0.323408 -0.095821 -0.482777 -0.179534 0.127999 0.137185 0.196655 0.195186 0.006796 -0.335822 0.124149 -0.205466 0.219595 -0.054668 0.233350 0.252918 0.228141 -0.179304 0.130871 0.140828 0.003800 -0.237683 -0.156005 -0.126854 0.148669 -0.137697 0.124338 0.193818 0.118212 0.142489 -0.270720 0.217722
charge: 0.350429 -0.015651 -0.039621 -0.432124 0.034548 0.032761 0.145782 -0.371586 -0.039349 0.061187 0.334293 0.032818 0.037766 0.000182 -0.388651 -0.050554 0.107426 0.028692 0.401967 -0.092417 0.619732 0.041654 0.016452 0.050910 0.006807 0.044606 0.042743 -0.115965 -0.017442 -0.005542 -0.015778 0.025787 0.011644 0.025176 -0.190890 0.022426 0.031648 0.370150 -0.102017
qa: -0.1661 0.1902 -0.1282 0.3261 0.1362 0.1315 -0.2934 0.3234 -0.0958 -0.4828 -0.1795 0.1280 0.1372 0.1967 0.1952 0.0068 -0.3358 0.1241 -0.2055 0.2196 -0.0547 0.2333 0.2529 0.2281 -0.1793 0.1309 0.1408 0.0038 -0.2377 -0.1560 -0.1269 0.1487 -0.1377 0.1243 0.1938 0.1182 0.1425 -0.2707 0.2177
va: 3.2609 1.0411 3.8856 4.3137 0.9964 0.9975 2.2012 4.0612 3.9158 2.0249 3.1583 0.9925 1.0023 1.0089 4.3296 3.9216 2.1859 1.0247 2.2774 1.0222 3.6208 0.9885 1.0065 1.0033 3.8242 1.0108 1.0251 3.5482 3.9895 4.0333 3.9283 1.0033 4.0056 1.0048 4.0952 1.0058 1.0091 2.2301 1.0253
dispcorr: -0.081203323 hartree
energy: -1047.223868595551
dipole: 6.39356 -5.41398 0.97958 1.99459 -1.12563 0.86896 3.35860 -3.97579 -0.61719
magnitude: 1.44761 au
magnitude: 3.67954 debye
zeropoint: 0.32431549 hartree
thermalvibcorrection: 0.01761847 hartree
thermalrotcorrection: 0.00141627 hartree
thermaltrasncorrection: 0.00141627 hartree
thermaltotal: -1046.87910210 hartree
thermalcorr: 0.02045101 hartree
nonthermalcorr: 0.32431549 hartree
totalcorr: 0.34476649 hartree
totalenthalpy: -1046.87815789 hartree
