program: Orca
programVersion: 5.0.2
elementType: N H C C H H O C C O N H H H C C O H O H N H H H C H H C C C C H C H C H H O H
charge: 1
multiplicity: 1
keywords: wB97X-D3BJ Opt Freq def2-TZVPP def2/J RIJCOSX VeryTightSCF
keywords: PAL8 defgrid3 VeryTightOpt
frequency: 0.00 0.00 0.00 0.00 0.00 0.00 16.10 30.87 36.88 49.57 56.02 74.40 103.17 113.23 145.57 152.05 161.41 218.34 227.01 232.46 294.26 301.64 321.09 326.48 362.79 370.80 385.42 420.60 428.98 433.17 444.65 453.12 512.12 521.32 566.35 576.02 578.64 611.58 628.31 646.84 654.78 658.94 707.76 736.34 762.33 770.66 805.97 830.34 854.10 870.39 873.68 884.21 927.09 943.31 961.20 978.49 996.63 1013.06 1041.19 1042.51 1076.70 1110.42 1138.56 1144.71 1153.69 1169.76 1192.62 1208.80 1224.87 1231.89 1254.52 1265.78 1301.49 1317.40 1320.46 1333.43 1338.08 1349.94 1361.61 1372.99 1387.29 1401.87 1426.43 1458.86 1486.62 1490.71 1494.64 1501.37 1508.59 1521.65 1562.42 1581.31 1611.98 1672.06 1681.10 1701.15 1774.71 1792.21 1822.52 3093.12 3113.52 3127.06 3140.37 3164.00 3173.62 3176.69 3196.54 3203.31 3204.92 3211.32 3232.98 3301.61 3495.27 3641.44 3677.42 3736.55 3877.26
frequency: 16.10 30.87 36.88 49.57 56.02 74.40 103.17 113.23 145.57 152.05 161.41 218.34 227.01 232.46 294.26 301.64 321.09 326.48 362.79 370.80 385.42 420.60 428.98 433.17 444.65 453.12 512.12 521.32 566.35 576.02 578.64 611.58 628.31 646.84 654.78 658.94 707.76 736.34 762.33 770.66 805.97 830.34 854.10 870.39 873.68 884.21 927.09 943.31 961.20 978.49 996.63 1013.06 1041.19 1042.51 1076.70 1110.42 1138.56 1144.71 1153.69 1169.76 1192.62 1208.80 1224.87 1231.89 1254.52 1265.78 1301.49 1317.40 1320.46 1333.43 1338.08 1349.94 1361.61 1372.99 1387.29 1401.87 1426.43 1458.86 1486.62 1490.71 1494.64 1501.37 1508.59 1521.65 1562.42 1581.31 1611.98 1672.06 1681.10 1701.15 1774.71 1792.21 1822.52 3093.12 3113.52 3127.06 3140.37 3164.00 3173.62 3176.69 3196.54 3203.31 3204.92 3211.32 3232.98 3301.61 3495.27 3641.44 3677.42 3736.55 3877.26
formula: C13H18N3O5
InChI: InChI=1S/C13H18N3O5/c14-10(5-8-1-3-9(17)4-2-8)13(21)16-6-11(18)15-7-12(19)20/h1-4,10,15-17,19H,5-7H2,14H3
39 atoms
N  -0.17148 -1.007342 -2.568424
H  -0.02747 -0.025235 -2.406839
C  0.434289 -1.602523 -3.751435
C  1.791166 -2.149991 -3.309117
H  -0.215998 -2.376432 -4.156697
H  0.595346 -0.830159 -4.499086
O  2.749398 -1.422782 -3.161042
C  -0.528094 -1.809596 -1.535028
C  -0.7782 -1.128523 -0.188129
O  -0.583858 -3.022794 -1.641116
N  0.096116 0.009204 0.048849
H  -0.669259 -1.901038 0.573114
H  -1.809799 -0.778449 -0.146327
H  -0.306724 0.931699 0.111686
C  1.449286 -0.006911 0.001533
C  2.158662 -1.367898 0.037866
O  2.123217 1.00696 -0.032878
H  1.676256 -2.100566 -0.603525
O  1.858094 -3.429068 -2.963388
H  0.967907 -3.810956 -2.909284
N  3.516384 -1.099659 -0.52365
H  4.23999 -1.608771 -0.015626
H  3.535652 -1.309845 -1.537919
H  3.672319 -0.086818 -0.387758
C  2.249118 -1.933448 1.477807
H  2.378861 -3.014475 1.403879
H  1.287629 -1.762903 1.965424
C  3.378409 -1.3374 2.28007
C  4.572393 -2.038709 2.429809
C  3.280576 -0.065729 2.850784
C  5.648896 -1.491969 3.11796
H  4.662461 -3.046036 2.031778
C  4.340993 0.490029 3.539603
H  2.359578 0.499643 2.763535
C  5.535179 -0.221258 3.673705
H  6.565424 -2.060172 3.235129
H  4.264685 1.471716 3.989579
O  6.535074 0.377428 4.359482
H  7.298039 -0.202728 4.424133
totalener: -1047.13068353 hartree
nucrepener: 1781.13221433 hartree
electener: -2828.26289787 hartree
oneelecener: -4944.80313578 hartree
twoeener: 2116.54023792 hartree
kineticenergy: 1041.98249084 hartree
exchangeener: -91.589985291855 hartree
correlationener: -6.620610753460 hartree
xcener: -98.210596045315 hartree
temp: 298.15 k
press: 1.00 atm
thermalcorrenthalpy: 0.00094421 hartree
totalenthalpy: -1046.87650582 hartree
totalentropycorr: -0.06257135 hartree
gibbsenthalpy: -1046.93907717 hartree
gibbsminuselec: 0.27921448 hartree
totalenthalpy: -1046.87895290 hartree
chargesum: 1.0000000
charge: -0.172639 0.191628 -0.111971 0.311838 0.148279 0.148009 -0.357459 0.195341 -0.087528 -0.366027 -0.233421 0.141059 0.148958 0.216767 0.187952 -0.017571 -0.318308 0.131820 -0.212545 0.257852 -0.035315 0.221752 0.240864 0.233079 -0.174260 0.152496 0.129871 0.017664 -0.269075 -0.147193 -0.124053 0.156288 -0.125880 0.126039 0.187560 0.117531 0.142088 -0.268490 0.216997
charge: 0.333633 -0.020332 -0.026340 -0.429532 0.033884 0.042417 0.127794 -0.400104 -0.029210 0.097934 0.331155 0.036029 0.044671 -0.005508 -0.388898 -0.039474 0.123645 0.029413 0.400118 -0.089276 0.619148 0.038686 -0.004814 0.032528 0.007712 0.041647 0.040615 -0.116813 -0.023084 0.004985 -0.015860 0.023941 0.016149 0.027394 -0.189111 0.022145 0.032755 0.371938 -0.101980
qa: -0.1726 0.1916 -0.1120 0.3118 0.1483 0.1480 -0.3575 0.1953 -0.0875 -0.3660 -0.2334 0.1411 0.1490 0.2168 0.1880 -0.0176 -0.3183 0.1318 -0.2125 0.2579 -0.0353 0.2218 0.2409 0.2331 -0.1743 0.1525 0.1299 0.0177 -0.2691 -0.1472 -0.1241 0.1563 -0.1259 0.1260 0.1876 0.1175 0.1421 -0.2685 0.2170
va: 3.1563 1.0184 3.8801 4.1918 1.0028 1.0087 2.1406 4.1924 3.8172 2.1406 3.1171 1.0088 0.9934 0.9942 4.2900 3.8467 2.1935 1.0284 2.2536 1.0101 3.6004 0.9995 1.0443 1.0160 3.8104 0.9925 1.0088 3.5460 4.0096 4.0383 3.9566 0.9994 3.9964 1.0039 4.1059 1.0059 1.0090 2.2334 1.0257
dispcorr: -0.087740309 hartree
energy: -1047.224792791640
dipole: -1.62348 0.83033 -0.79315 -1.76171 1.44350 -0.31821 1.59140 -2.48906 -0.89767
magnitude: 1.23941 au
magnitude: 3.15034 debye
zeropoint: 0.32492701 hartree
thermalvibcorrection: 0.01713561 hartree
thermalrotcorrection: 0.00141627 hartree
thermaltrasncorrection: 0.00141627 hartree
thermaltotal: -1046.87989763 hartree
thermalcorr: 0.01996816 hartree
nonthermalcorr: 0.32492701 hartree
totalcorr: 0.34489516 hartree
totalenthalpy: -1046.87895342 hartree
