program: Gaussian 09
title: 000047344
version: EM64L-G09RevD.01
frameworkgroup: C1[X(C24H25NO3)]
method: RPBEPBE
basis: SDD
operation: Freq
keyword: #p
keyword: freq=noraman
keyword: PBEPBE/SDD
title: #p freq=noraman PBEPBE/SDD
converged: YES YES NO NO
title: Mulliken charges:
elementType: O O O N C C C C C C C C C C C C C C C C C C C C C C C C H H H H H H H H H H H H H H H H H H H H H H H H H
charge: -0.293965 -0.256408 -0.310412 0.006470 0.314361 -0.261049 -0.382815 -0.746724 -0.734650 -0.273457 0.276758 0.365776 -0.792283 -0.790751 -0.184514 0.542414 -0.201566 -0.537117 -0.440452 0.348262 -0.197540 -0.392067 0.348495 -0.351531 -0.381217 -0.208163 -0.193139 -0.250020 0.262822 0.263418 0.255384 0.212660 0.214090 0.223067 0.215789 0.224627 0.199481 0.224703 0.221329 0.237273 0.218211 0.220892 0.227685 0.287251 0.286523 0.270008 0.235031 0.263284 0.262748 0.258705 0.229210 0.231632 0.231481
chargesum: 0.00000
title: Mulliken charges with hydrogens summed into heavy atoms:
elementType: O O O N C C C C C C C C C C C C C C C C C C C C C C C C
charge: -0.293965 -0.256408 -0.310412 0.006470 0.314361 0.001774 -0.119397 -0.064590 -0.071167 -0.073976 0.276758 0.365776 -0.108978 -0.123962 0.102736 0.542414 -0.201566 -0.250594 -0.170445 0.348262 0.037491 -0.128783 0.348495 -0.088783 -0.122512 0.021047 0.038494 -0.018539
polarizability: 3.12719306e+02 5.21175531e+00 3.05151250e+02 3.32871667e+00 2.90468000e+01 2.22697827e+02
1716.lowfreq: -6.9170 -3.5253 -0.0007 -0.0004 0.0005 4.1032 9.8080 11.1798 13.7659
frequency: 9.6635 10.9787 12.6276 22.4124 29.8296 42.1631 56.2830 60.6188 70.5785 77.9469 95.9654 102.1617 121.8844 133.3754 142.7388 173.2979 181.7371 192.1600 203.4753 219.8633 223.8142 240.3138 253.5286 274.6938 300.3922 310.6229 316.2768 323.7757 345.0150 362.8559 378.8354 408.0555 410.5401 424.0753 434.6525 452.8565 455.7178 480.5516 504.7191 511.2546 541.7077 562.1509 573.3172 599.7742 611.8130 620.6154 641.6782 669.9305 692.0961 700.1766 720.1917 732.6424 764.2737 789.9925 809.1230 818.1979 824.3492 836.0309 846.6618 854.7342 876.7771 900.1171 910.8229 914.2483 918.3899 949.2763 954.9740 956.4263 969.2042 973.1981 983.7879 986.8307 987.6084 988.9113 988.9546 998.1746 1001.4968 1019.8405 1039.5533 1047.2826 1072.2346 1078.2362 1081.8138 1088.2180 1122.7152 1139.4828 1151.2575 1167.9571 1172.9741 1177.2860 1178.9451 1195.0098 1210.8315 1235.6336 1242.9435 1274.9956 1278.2832 1286.0546 1308.5853 1322.3650 1327.8399 1357.2875 1381.7558 1387.1917 1391.6579 1392.0604 1399.6036 1402.9100 1411.5049 1439.9696 1445.7231 1454.0872 1463.5105 1466.2165 1470.1635 1471.3539 1472.5714 1476.3026 1478.3024 1484.1632 1490.1245 1594.4605 1595.5295 1606.0201 1613.3897 1618.9584 1683.8911 2204.8704 2958.7643 2967.2817 2975.1861 2979.7264 3015.2944 3029.9704 3035.1656 3056.6956 3067.8231 3079.1227 3083.4216 3092.9770 3097.3922 3107.1414 3131.7531 3134.3056 3141.0994 3142.7362 3147.6290 3148.6650 3155.3172 3159.8235 3164.7144 3175.3499 3175.6677
redmass: 4.3915 4.7463 3.6162 4.2467 4.8711 4.3833 5.3154 5.4835 3.5221 7.4721 5.3915 1.3015 2.5087 3.2903 3.0944 1.1448 1.3962 4.6430 2.2988 3.6588 2.3238 2.5112 3.1791 3.2801 5.6584 3.3726 3.5513 6.3431 4.1575 2.5316 5.2896 2.8066 2.9157 5.1626 3.3300 3.3500 2.7851 3.3533 2.9389 3.5395 7.0532 7.6890 5.2688 4.9400 5.9205 6.2255 6.0097 5.4266 2.2996 2.3466 4.7096 4.1042 1.7033 3.3705 1.8388 3.9373 4.6951 1.2991 2.8928 1.8261 4.4856 1.5176 2.7759 1.4756 1.6377 1.3916 3.2384 1.5048 1.3652 1.4548 1.6133 5.2427 3.0222 1.2858 1.3748 2.8137 1.5758 2.0932 1.5439 1.6165 1.4024 1.5104 1.6175 1.6102 1.8589 1.9249 3.1534 1.1816 1.1546 1.1490 2.2215 2.2391 2.4779 2.6472 2.2742 1.3828 1.6413 1.4458 1.3494 1.6782 1.4723 1.7886 7.7301 1.2244 1.3012 7.7708 1.3999 1.2465 1.7762 2.3706 2.5290 1.0496 1.0542 1.0540 1.4873 1.3843 1.0493 1.0846 2.5272 1.1357 1.0519 6.3779 6.4517 6.5388 6.5702 10.1911 6.3521 12.5919 1.0373 1.0392 1.0374 1.0364 1.0824 1.0968 1.0962 1.0991 1.0989 1.0983 1.0974 1.0896 1.0963 1.0970 1.0851 1.0887 1.0888 1.0873 1.0873 1.0921 1.0932 1.0935 1.0966 1.0990 1.1001
irintensity: 0.0077 0.2168 0.1693 0.0480 0.7904 0.8815 1.1698 1.3579 0.7825 1.9892 1.2235 0.9319 2.1266 0.2737 0.7981 1.0238 0.3667 1.3663 2.3815 1.4682 0.7165 0.8502 8.0016 1.5447 0.2080 0.8806 2.7105 3.5669 3.2867 0.7627 3.5143 3.6227 1.1989 5.1667 10.1889 6.4302 1.0788 22.6270 5.2127 9.1665 18.2522 0.4868 4.6223 3.9916 3.9984 3.7957 8.3201 0.7074 41.2467 31.0954 0.6366 3.0456 93.8440 2.5045 69.5764 5.1550 32.5698 2.2929 4.8459 28.9008 185.6247 6.7140 70.2520 2.3912 14.4757 0.5757 32.9636 9.1486 0.2378 32.1141 1.3293 2.8119 4.6795 2.0576 2.2521 47.4889 3.1719 12.3614 6.5741 24.5597 2.4349 10.5603 4.4870 11.6409 84.0656 7.7321 106.8412 34.5962 33.4851 1.1262 58.9263 99.7345 232.2445 174.7960 7.0725 39.2366 67.8690 41.8207 0.9826 3.0370 12.0483 8.8150 6.2220 12.1936 33.9731 8.2491 13.9845 13.6783 2.8507 18.9697 50.6982 1.8334 10.8863 6.2933 95.4496 57.4507 26.8935 4.3450 19.8884 8.9817 16.3992 4.4679 148.9877 29.8507 15.7663 291.3448 6.2165 1.5236 48.0123 50.0485 27.9344 41.0086 22.7229 11.3872 34.8629 15.2576 34.1164 19.3916 24.6275 32.2892 36.1895 13.0319 2.0545 6.7046 7.9113 7.3368 7.4804 3.7531 23.5861 3.9870 15.5003 11.3770 5.6244
temp: 298.150 k
press: 1.00000 atm
elementType: 8 8 8 7 6 6 6 6 6 6 6 6 6 6 6 6 6 6 6 6 6 6 6 6 6 6 6 6 1 1 1 1 1 1 1 1 1 1 1 1 1 1 1 1 1 1 1 1 1 1 1 1 1
symmnumber: 1
zpe: 1112155.6 jmol-1
zpe.correction: 0.423598 hartree
zpe.thermalcorrener: 0.452016 hartree
zpe.thermalcorrenthalpy: 0.452960 hartree
zpe.thermalcorrgfe: 0.359212 hartree
zpe.sumelectzpe: -1207.891427 hartree
zpe.sumelectthermal: -1207.863008 hartree
zpe.sumelectthermalent: -1207.862064 hartree
zpe.sumelectthermalfe: -1207.955813 hartree
dipole: 1.2343 1.7285 -3.5635
dipole: 4.1485
quadrupole: -151.8097 -156.5022 -175.3207
quadrupole: 5.9296 -2.0032 2.8893
quadrupole: 9.4011 4.7087 -14.1098 5.9296 -2.0032 2.8893
hfenergy: -1208.3150245 hartree
pointgroup: C01 [X(C24H25N1O3)]
dipole: -0.9335424 -0.2318342 -1.3185824 debye
polarizability: 308.6583685|0.4376871|307.6815487|-28.7793802|-14.0654386|224.2284653 unknown
InChI: InChI=1S/C24H25NO3/c1-16(2)13-20-22(24(20,3)4)23(26)28-21(15-25)17-9-8-12-19(14-17)27-18-10-6-5-7-11-18/h5-14,20-22H,1-4H3
charge 0 multiplicity 1
53 atoms
O  -0.53445 1.091865 0.874408
O  -0.581276 3.424161 0.686879
O  3.86057 -1.635066 -1.309394
N  0.870411 -0.556767 3.487608
C  -2.736483 1.093899 -1.344777
C  -3.326756 0.854392 0.051537
C  -2.434001 2.125306 -0.203552
C  -1.644045 0.147947 -1.840088
C  -3.630394 1.620364 -2.468712
C  -4.765599 1.017116 0.383802
C  -1.130315 2.316627 0.463362
C  -5.442751 0.393366 1.394673
C  -4.824059 -0.580171 2.381643
C  -6.926272 0.648909 1.603266
C  0.827266 1.2330 1.514628
C  1.918524 1.042064 0.470478
C  0.847163 0.238269 2.59974
C  2.348395 -0.253627 0.098659
C  2.468164 2.188382 -0.154112
C  3.319652 -0.390303 -0.917248
C  3.453253 2.031499 -1.154556
C  3.881833 0.745506 -1.543712
C  3.092121 -2.829896 -1.244996
C  1.724633 -2.878677 -1.602871
C  3.802241 -4.001046 -0.905371
C  1.063672 -4.127316 -1.602091
C  3.128852 -5.242113 -0.914535
C  1.758022 -5.310725 -1.257829
H  -2.792138 0.087026 0.62061
H  -2.964438 3.077625 -0.30325
H  -1.016767 -0.224669 -1.015207
H  -2.111351 -0.718243 -2.346042
H  -0.987366 0.65495 -2.572597
H  -4.198468 0.788798 -2.926832
H  -4.357839 2.374158 -2.121862
H  -3.013978 2.088403 -3.258256
H  -5.334379 1.709398 -0.25393
H  -4.982139 -0.227632 3.419999
H  -5.312991 -1.572069 2.309355
H  -3.741207 -0.724785 2.241095
H  -7.505515 -0.293627 1.534013
H  -7.118719 1.062715 2.613315
H  -7.333287 1.356108 0.859862
H  0.882001 2.255511 1.936763
H  1.943443 -1.138619 0.601023
H  2.11449 3.184575 0.130893
H  3.886462 2.913916 -1.636529
H  4.643642 0.600765 -2.31534
H  1.190572 -1.966203 -1.887537
H  4.861463 -3.923212 -0.643117
H  0.00473 -4.173001 -1.87946
H  3.675283 -6.153678 -0.649357
H  1.237926 -6.274271 -1.259953
