program: Orca
programVersion: 5.0.2
elementType: N H C C H H O C C O N H H H C C O H O H N H H H C H H C C C C H C H C H H O H
charge: 1
multiplicity: 1
keywords: wB97X-D3BJ Opt Freq def2-TZVPP def2/J RIJCOSX VeryTightSCF
keywords: PAL8 defgrid3 VeryTightOpt
frequency: 0.00 0.00 0.00 0.00 0.00 0.00 12.10 22.48 39.44 43.18 55.60 63.79 67.23 91.31 114.31 138.75 165.37 178.82 185.18 204.08 262.31 297.80 310.85 325.38 341.01 351.83 372.82 386.04 424.03 432.02 435.30 496.60 505.67 522.10 545.49 569.22 581.83 609.26 623.71 636.38 657.24 658.45 665.65 737.74 753.04 791.41 828.24 847.82 860.34 874.92 893.44 898.59 901.60 943.74 968.99 979.07 1010.09 1025.78 1027.96 1042.69 1045.56 1087.43 1130.58 1141.04 1151.69 1157.46 1195.61 1206.68 1207.97 1247.45 1251.39 1253.14 1265.97 1298.57 1306.08 1329.97 1339.31 1342.11 1352.29 1370.22 1386.93 1410.99 1452.94 1467.19 1476.25 1492.95 1496.36 1498.31 1501.08 1518.20 1579.57 1593.53 1644.90 1664.73 1670.44 1700.58 1765.58 1776.10 1850.94 3092.24 3094.11 3100.39 3133.10 3159.64 3177.01 3179.38 3184.47 3201.07 3203.36 3230.11 3300.09 3376.37 3549.60 3622.12 3634.09 3800.19 3877.42
frequency: 12.10 22.48 39.44 43.18 55.60 63.79 67.23 91.31 114.31 138.75 165.37 178.82 185.18 204.08 262.31 297.80 310.85 325.38 341.01 351.83 372.82 386.04 424.03 432.02 435.30 496.60 505.67 522.10 545.49 569.22 581.83 609.26 623.71 636.38 657.24 658.45 665.65 737.74 753.04 791.41 828.24 847.82 860.34 874.92 893.44 898.59 901.60 943.74 968.99 979.07 1010.09 1025.78 1027.96 1042.69 1045.56 1087.43 1130.58 1141.04 1151.69 1157.46 1195.61 1206.68 1207.97 1247.45 1251.39 1253.14 1265.97 1298.57 1306.08 1329.97 1339.31 1342.11 1352.29 1370.22 1386.93 1410.99 1452.94 1467.19 1476.25 1492.95 1496.36 1498.31 1501.08 1518.20 1579.57 1593.53 1644.90 1664.73 1670.44 1700.58 1765.58 1776.10 1850.94 3092.24 3094.11 3100.39 3133.10 3159.64 3177.01 3179.38 3184.47 3201.07 3203.36 3230.11 3300.09 3376.37 3549.60 3622.12 3634.09 3800.19 3877.42
formula: C13H18N3O5
InChI: InChI=1S/C13H18N3O5/c14-10(5-8-1-3-9(17)4-2-8)13(21)16-6-11(18)15-7-12(19)20/h1-4,10,15-17,19H,5-7H2,14H3
39 atoms
N  -2.333486 -2.199649 1.297099
H  -3.078382 -1.590888 0.990576
C  -2.681405 -3.133242 2.344852
C  -4.136179 -2.913688 2.699033
H  -2.536295 -4.166652 2.022419
H  -2.065018 -2.984003 3.234154
O  -4.832613 -2.084674 2.17337
C  -1.108141 -2.155773 0.763253
C  -0.890126 -1.134443 -0.352991
O  -0.188614 -2.883135 1.115501
N  -0.008885 -0.037267 0.035782
H  -1.828379 -0.687418 -0.678746
H  -0.477074 -1.674664 -1.20666
H  -0.42245 0.88157 0.092292
C  1.33658 -0.005981 0.043827
C  2.135246 -1.309584 0.102284
O  1.97895 1.034665 0.069071
H  1.646702 -2.170074 -0.346544
O  -4.537994 -3.747527 3.657528
H  -5.469368 -3.568128 3.846619
N  3.400528 -1.002545 -0.649125
H  4.158393 -1.590566 -0.280134
H  3.581368 -0.001515 -0.467699
H  3.31737 -1.143771 -1.653472
C  2.542249 -1.619552 1.555017
H  1.634552 -1.87092 2.097968
H  2.967994 -0.713862 1.994835
C  3.537279 -2.752225 1.589613
C  4.887775 -2.517076 1.831998
C  3.125336 -4.062637 1.320462
C  5.815201 -3.554856 1.806782
H  5.22706 -1.514972 2.079592
C  4.03516 -5.100614 1.293283
H  2.072687 -4.26452 1.150753
C  5.388984 -4.850069 1.535551
H  6.861213 -3.355024 2.013347
H  3.721101 -6.118471 1.098823
O  6.227392 -5.911455 1.495025
H  7.123931 -5.643776 1.712719
totalener: -1047.13706590 hartree
nucrepener: 1655.63127986 hartree
electener: -2702.76834576 hartree
oneelecener: -4696.11336531 hartree
twoeener: 1993.34501956 hartree
kineticenergy: 1041.97783515 hartree
exchangeener: -91.587211963750 hartree
correlationener: -6.612080623878 hartree
xcener: -98.199292587628 hartree
temp: 298.15 k
press: 1.00 atm
thermalcorrenthalpy: 0.00094421 hartree
totalenthalpy: -1046.87544931 hartree
totalentropycorr: -0.06458447 hartree
gibbsenthalpy: -1046.94003379 hartree
gibbsminuselec: 0.27728367 hartree
totalenthalpy: -1046.87731316 hartree
chargesum: 1.0000000
charge: -0.170552 0.181334 -0.060463 0.304294 0.133014 0.130043 -0.322455 0.313006 -0.130138 -0.436037 -0.174005 0.129090 0.129776 0.203817 0.227839 0.002454 -0.360211 0.149191 -0.252661 0.244680 -0.056424 0.234403 0.232618 0.228624 -0.158238 0.139578 0.148878 -0.035818 -0.274306 -0.156093 -0.126783 0.158147 -0.124988 0.150501 0.190577 0.117806 0.143117 -0.270344 0.216727
charge: 0.343313 -0.021647 -0.026997 -0.433688 0.039893 0.038747 0.115977 -0.394740 -0.030536 0.069071 0.343152 0.032929 0.030771 0.000543 -0.380185 -0.036913 0.097253 0.028524 0.383676 -0.075408 0.617694 0.042081 0.037577 0.046986 0.008229 0.038566 0.039276 -0.115798 -0.023880 0.005858 -0.018937 0.024331 0.012973 0.031669 -0.190526 0.021486 0.031755 0.369574 -0.102649
qa: -0.1706 0.1813 -0.0605 0.3043 0.1330 0.1300 -0.3225 0.3130 -0.1301 -0.4360 -0.1740 0.1291 0.1298 0.2038 0.2278 0.0025 -0.3602 0.1492 -0.2527 0.2447 -0.0564 0.2344 0.2326 0.2286 -0.1582 0.1396 0.1489 -0.0358 -0.2743 -0.1561 -0.1268 0.1581 -0.1250 0.1505 0.1906 0.1178 0.1431 -0.2703 0.2167
va: 3.2171 1.0408 3.8609 4.3242 1.0075 1.0091 2.1686 4.0880 3.8829 2.0559 3.1732 1.0065 1.0006 1.0045 4.2789 3.8359 2.1568 1.0223 2.2410 1.0127 3.6393 1.0048 1.0200 0.9782 3.7669 1.0365 1.0132 3.6241 4.0008 3.9949 3.9378 1.0012 3.9844 1.0212 4.0932 1.0064 1.0094 2.2301 1.0258
dispcorr: -0.080952362 hartree
energy: -1047.223032380195
dipole: 7.14229 -5.97557 1.16671 1.86996 -0.75746 1.11250 -4.01480 2.10667 -1.90813
magnitude: 2.49796 au
magnitude: 6.34932 debye
zeropoint: 0.32423109 hartree
thermalvibcorrection: 0.01771253 hartree
thermalrotcorrection: 0.00141627 hartree
thermaltrasncorrection: 0.00141627 hartree
thermaltotal: -1046.87825622 hartree
thermalcorr: 0.02054507 hartree
nonthermalcorr: 0.32423109 hartree
totalcorr: 0.34477616 hartree
totalenthalpy: -1046.87731201 hartree
