program: Orca
programVersion: 5.0.2
elementType: N H C C H H O C C O N H H H C C O H O H N H H H C H H C C C C H C H C H H O H
charge: 1
multiplicity: 1
keywords: wB97X-D3BJ Opt Freq def2-TZVPP def2/J RIJCOSX VeryTightSCF
keywords: PAL8 defgrid3 VeryTightOpt
frequency: 0.00 0.00 0.00 0.00 0.00 0.00 19.08 28.61 36.27 49.92 51.05 72.19 80.90 92.66 97.65 147.59 166.99 220.10 238.05 249.70 298.81 302.09 324.71 328.67 345.23 366.76 379.13 396.48 415.54 427.66 434.73 447.06 485.17 509.86 518.66 560.63 579.98 592.11 596.83 631.03 659.47 669.29 690.01 738.73 745.85 770.86 793.66 801.88 853.57 870.76 875.62 883.21 894.08 961.67 972.44 988.89 1002.31 1009.80 1043.16 1051.60 1057.91 1116.32 1133.24 1142.94 1160.02 1169.87 1197.21 1207.63 1211.74 1233.83 1252.10 1253.97 1298.41 1324.83 1330.65 1335.42 1348.10 1353.43 1364.26 1371.11 1388.35 1395.47 1445.88 1464.64 1475.52 1487.03 1492.25 1496.62 1500.58 1523.50 1569.36 1582.27 1634.73 1675.62 1686.24 1703.84 1783.81 1796.58 1811.68 3063.61 3109.62 3119.08 3121.25 3160.60 3170.57 3177.74 3187.60 3190.33 3203.82 3232.96 3235.99 3351.26 3548.81 3645.09 3693.82 3799.19 3879.10
frequency: 19.08 28.61 36.27 49.92 51.05 72.19 80.90 92.66 97.65 147.59 166.99 220.10 238.05 249.70 298.81 302.09 324.71 328.67 345.23 366.76 379.13 396.48 415.54 427.66 434.73 447.06 485.17 509.86 518.66 560.63 579.98 592.11 596.83 631.03 659.47 669.29 690.01 738.73 745.85 770.86 793.66 801.88 853.57 870.76 875.62 883.21 894.08 961.67 972.44 988.89 1002.31 1009.80 1043.16 1051.60 1057.91 1116.32 1133.24 1142.94 1160.02 1169.87 1197.21 1207.63 1211.74 1233.83 1252.10 1253.97 1298.41 1324.83 1330.65 1335.42 1348.10 1353.43 1364.26 1371.11 1388.35 1395.47 1445.88 1464.64 1475.52 1487.03 1492.25 1496.62 1500.58 1523.50 1569.36 1582.27 1634.73 1675.62 1686.24 1703.84 1783.81 1796.58 1811.68 3063.61 3109.62 3119.08 3121.25 3160.60 3170.57 3177.74 3187.60 3190.33 3203.82 3232.96 3235.99 3351.26 3548.81 3645.09 3693.82 3799.19 3879.10
formula: C13H18N3O5
InChI: InChI=1S/C13H18N3O5/c14-10(5-8-1-3-9(17)4-2-8)13(21)16-6-11(18)15-7-12(19)20/h1-4,10,15-17,19H,5-7H2,14H3
39 atoms
N  -0.304677 -1.059174 -2.600865
H  -0.301394 -0.061622 -2.485391
C  0.010717 -1.626871 -3.881835
C  1.478958 -1.977158 -4.03694
H  -0.562385 -2.542102 -4.036047
H  -0.254654 -0.933684 -4.681535
O  2.356328 -1.726581 -3.23613
C  -0.522235 -1.86563 -1.526334
C  -0.805406 -1.15408 -0.201836
O  -0.477537 -3.076043 -1.596816
N  0.026234 0.024239 -0.005634
H  -0.677483 -1.880497 0.598535
H  -1.847269 -0.832822 -0.193968
H  -0.407537 0.928224 0.100657
C  1.369451 0.038238 0.029883
C  2.135304 -1.29614 0.042891
O  2.034759 1.062321 0.066757
H  1.608417 -2.118847 -0.434746
O  1.703418 -2.591869 -5.186346
H  2.645494 -2.795605 -5.267031
N  3.355836 -1.005151 -0.77601
H  4.139389 -1.599819 -0.516039
H  3.131007 -1.146505 -1.776455
H  3.583941 -0.015648 -0.6007
C  2.537983 -1.670646 1.475805
H  3.077582 -0.830688 1.920795
H  3.222077 -2.523481 1.425778
C  1.330197 -2.0289 2.30408
C  0.776533 -3.307655 2.227602
C  0.70853 -1.080381 3.107593
C  -0.373135 -3.631888 2.92421
H  1.247576 -4.066039 1.610103
C  -0.446222 -1.389929 3.813084
H  1.128056 -0.082903 3.191031
C  -0.990877 -2.668829 3.722179
H  -0.802427 -4.624147 2.870373
H  -0.915203 -0.642156 4.444018
O  -2.112469 -3.039965 4.384487
H  -2.42603 -2.324652 4.943547
totalener: -1047.14396527 hartree
nucrepener: 1777.78510252 hartree
electener: -2824.92906779 hartree
oneelecener: -4939.31316992 hartree
twoeener: 2114.38410213 hartree
kineticenergy: 1042.00982669 hartree
exchangeener: -91.598460082003 hartree
correlationener: -6.617445441088 hartree
xcener: -98.215905523091 hartree
temp: 298.15 k
press: 1.00 atm
thermalcorrenthalpy: 0.00094421 hartree
totalenthalpy: -1046.88788517 hartree
totalentropycorr: -0.06358186 hartree
gibbsenthalpy: -1046.95146703 hartree
gibbsminuselec: 0.27823962 hartree
totalenthalpy: -1046.89002559 hartree
chargesum: 1.0000000
charge: -0.202026 0.181112 -0.099162 0.379014 0.152382 0.152679 -0.409895 0.207512 -0.060568 -0.328818 -0.197993 0.122475 0.148716 0.210007 0.166282 0.002932 -0.345005 0.150372 -0.224165 0.244284 -0.063001 0.221323 0.244084 0.227734 -0.160130 0.140085 0.113925 0.008639 -0.175264 -0.198732 -0.114468 0.121838 -0.125761 0.137247 0.174776 0.140987 0.112982 -0.271879 0.215480
charge: 0.325529 -0.026882 -0.038028 -0.398895 0.049718 0.043842 0.105447 -0.404015 -0.024711 0.105177 0.344398 0.038341 0.040690 -0.005930 -0.387163 -0.038975 0.098026 0.035820 0.411419 -0.070995 0.614399 0.042259 -0.017243 0.033550 -0.001666 0.041542 0.034647 -0.111299 -0.001421 -0.001418 0.005603 0.027574 -0.019046 0.027977 -0.193929 0.031447 0.020786 0.367754 -0.104328
qa: -0.2020 0.1811 -0.0992 0.3790 0.1524 0.1527 -0.4099 0.2075 -0.0606 -0.3288 -0.1980 0.1225 0.1487 0.2100 0.1663 0.0029 -0.3450 0.1504 -0.2242 0.2443 -0.0630 0.2213 0.2441 0.2277 -0.1601 0.1401 0.1139 0.0086 -0.1753 -0.1987 -0.1145 0.1218 -0.1258 0.1372 0.1748 0.1410 0.1130 -0.2719 0.2155
va: 3.1260 1.0197 3.8431 4.1534 1.0177 1.0023 2.0414 4.2429 3.7648 2.1884 3.1220 1.0478 0.9908 0.9984 4.3401 3.7991 2.1833 1.0393 2.2838 1.0140 3.5858 0.9808 1.0469 1.0174 3.8645 1.0128 1.0065 3.6135 4.0224 4.0285 3.9623 1.0084 3.8983 1.0059 4.0888 1.0095 1.0070 2.2274 1.0267
dispcorr: -0.086392566 hartree
energy: -1047.235758973262
dipole: 3.14946 -1.52218 1.62728 1.62837 -0.31515 1.31322 1.81555 -3.39017 -1.57463
magnitude: 2.61764 au
magnitude: 6.65350 debye
zeropoint: 0.32449337 hartree
thermalvibcorrection: 0.01746406 hartree
thermalrotcorrection: 0.00141627 hartree
thermaltrasncorrection: 0.00141627 hartree
thermaltotal: -1046.89096900 hartree
thermalcorr: 0.02029660 hartree
nonthermalcorr: 0.32449337 hartree
totalcorr: 0.34478997 hartree
totalenthalpy: -1046.89002479 hartree
