program: Orca
programVersion: 5.0.2
elementType: N H C C H H O C C O N H H H C C O H O H N H H H C H H C C C C H C H C H H O H
charge: 1
multiplicity: 1
keywords: wB97X-D3BJ Opt Freq def2-TZVPP def2/J RIJCOSX VeryTightSCF
keywords: PAL8 defgrid3 VeryTightOpt
frequency: 0.00 0.00 0.00 0.00 0.00 0.00 29.23 42.45 49.72 56.84 83.68 88.03 100.26 113.01 125.79 149.21 178.27 215.17 230.79 252.74 255.51 282.14 309.26 341.81 355.87 386.90 394.30 424.90 432.65 443.85 491.68 499.69 510.48 520.94 537.99 546.60 579.16 609.24 616.08 652.83 659.93 667.98 710.74 715.38 756.10 764.87 806.18 836.26 860.68 871.25 881.24 895.25 914.52 931.12 957.88 985.81 1000.14 1016.38 1042.98 1057.09 1063.01 1122.14 1132.93 1143.23 1147.30 1184.31 1201.37 1207.04 1223.84 1245.84 1257.53 1281.23 1297.35 1320.06 1331.06 1337.88 1338.71 1356.97 1371.72 1384.42 1410.71 1415.11 1437.97 1458.86 1469.43 1479.40 1487.26 1502.68 1511.86 1583.91 1601.07 1624.22 1665.79 1669.96 1685.54 1702.05 1719.34 1815.36 1844.93 2449.38 3064.12 3108.91 3118.21 3133.63 3137.71 3170.78 3179.08 3181.42 3198.29 3227.93 3229.28 3496.26 3559.27 3607.78 3662.98 3797.39 3819.10
frequency: 29.23 42.45 49.72 56.84 83.68 88.03 100.26 113.01 125.79 149.21 178.27 215.17 230.79 252.74 255.51 282.14 309.26 341.81 355.87 386.90 394.30 424.90 432.65 443.85 491.68 499.69 510.48 520.94 537.99 546.60 579.16 609.24 616.08 652.83 659.93 667.98 710.74 715.38 756.10 764.87 806.18 836.26 860.68 871.25 881.24 895.25 914.52 931.12 957.88 985.81 1000.14 1016.38 1042.98 1057.09 1063.01 1122.14 1132.93 1143.23 1147.30 1184.31 1201.37 1207.04 1223.84 1245.84 1257.53 1281.23 1297.35 1320.06 1331.06 1337.88 1338.71 1356.97 1371.72 1384.42 1410.71 1415.11 1437.97 1458.86 1469.43 1479.40 1487.26 1502.68 1511.86 1583.91 1601.07 1624.22 1665.79 1669.96 1685.54 1702.05 1719.34 1815.36 1844.93 2449.38 3064.12 3108.91 3118.21 3133.63 3137.71 3170.78 3179.08 3181.42 3198.29 3227.93 3229.28 3496.26 3559.27 3607.78 3662.98 3797.39 3819.10
formula: C13H18N3O5
InChI: InChI=1S/C13H18N3O5/c14-10(5-8-1-3-9(17)4-2-8)13(21)16-6-11(18)15-7-12(19)20/h1-4,10,15-17,19H,5-7H2,14H3
39 atoms
N  -2.934474 -2.214994 -0.068407
H  -3.358361 -1.743389 -0.85064
C  -3.669326 -3.295785 0.546416
C  -3.978979 -4.406258 -0.441242
H  -3.076458 -3.703715 1.364109
H  -4.609091 -2.936192 0.97004
O  -3.641383 -4.416296 -1.59776
C  -1.663158 -1.930831 0.230214
C  -0.996827 -0.883051 -0.642277
O  -1.047404 -2.519233 1.126664
N  -0.021482 -0.034776 0.039044
H  -1.753875 -0.229148 -1.075484
H  -0.547795 -1.421808 -1.474129
H  -0.308246 0.934163 0.056383
C  1.361608 -0.054752 -0.079443
C  2.18016 -1.329838 0.195816
O  1.985678 0.965041 -0.24401
H  3.093634 -0.942663 0.646586
O  -4.686235 -5.369203 0.144251
H  -4.887856 -6.053069 -0.509531
N  1.521078 -2.174731 1.250314
H  1.972915 -3.085166 1.308677
H  1.617719 -1.726974 2.160354
H  0.457069 -2.319663 1.117527
C  2.592586 -2.148136 -1.037034
H  3.229655 -2.969812 -0.692533
H  3.23288 -1.492159 -1.628712
C  1.4520 -2.658117 -1.875265
C  1.093339 -2.006117 -3.056232
C  0.679172 -3.739914 -1.461302
C  -0.047605 -2.365199 -3.755799
H  1.700619 -1.184005 -3.42012
C  -0.470166 -4.106463 -2.142973
H  0.966452 -4.319013 -0.58875
C  -0.862762 -3.391661 -3.275558
H  -0.335479 -1.847809 -4.66248
H  -1.06611 -4.943983 -1.803294
O  -2.004761 -3.657645 -3.943422
H  -2.582603 -4.204928 -3.398974
totalener: -1047.12775367 hartree
nucrepener: 1824.24996246 hartree
electener: -2871.37771613 hartree
oneelecener: -5031.78194147 hartree
twoeener: 2160.40422534 hartree
kineticenergy: 1042.00108439 hartree
exchangeener: -91.596062398385 hartree
correlationener: -6.621237215157 hartree
xcener: -98.217299613541 hartree
temp: 298.15 k
press: 1.00 atm
thermalcorrenthalpy: 0.00094421 hartree
totalenthalpy: -1046.87523124 hartree
totalentropycorr: -0.06263118 hartree
gibbsenthalpy: -1046.93786242 hartree
gibbsminuselec: 0.27847392 hartree
chargesum: 1.0000000
charge: -0.140854 0.189987 -0.085852 0.322382 0.141514 0.158104 -0.361546 0.299264 -0.051932 -0.406005 -0.225555 0.137689 0.082907 0.186104 0.144430 0.007679 -0.255063 0.171972 -0.242802 0.247374 -0.084385 0.207151 0.224522 0.215310 -0.221309 0.131645 0.139468 0.025701 -0.109160 -0.201015 -0.121755 0.138725 -0.145001 0.109430 0.159221 0.142760 0.116194 -0.286188 0.238890
charge: 0.361005 -0.003651 -0.023284 -0.429383 0.043348 0.041864 0.107357 -0.338845 -0.031493 0.152810 0.293734 0.035031 0.032086 -0.008635 -0.371459 -0.052519 0.149919 0.047883 0.392976 -0.072836 0.589589 0.033894 0.045127 -0.078933 -0.000990 0.036638 0.052782 -0.116687 0.000644 -0.019187 0.003365 0.030700 -0.016247 0.017560 -0.206517 0.031666 0.020737 0.367998 -0.118047
qa: -0.1409 0.1900 -0.0859 0.3224 0.1415 0.1581 -0.3615 0.2993 -0.0519 -0.4060 -0.2256 0.1377 0.0829 0.1861 0.1444 0.0077 -0.2551 0.1720 -0.2428 0.2474 -0.0844 0.2072 0.2245 0.2153 -0.2213 0.1316 0.1395 0.0257 -0.1092 -0.2010 -0.1218 0.1387 -0.1450 0.1094 0.1592 0.1428 0.1162 -0.2862 0.2389
va: 3.2872 1.0110 3.7838 4.2945 1.0281 1.0000 2.1105 4.1310 3.8443 2.1191 3.0670 1.0061 1.0336 1.0180 4.3808 3.7332 2.2483 1.0084 2.2567 1.0110 3.5415 0.9912 0.9798 1.1273 3.8612 1.0014 1.0149 3.5214 3.9521 3.9304 3.9593 1.0045 3.8626 1.0094 4.0681 1.0109 1.0155 2.2232 1.0271
dispcorr: -0.088595994 hartree
energy: -1047.222368912006
dipole: 5.71301 -5.61446 0.09855 0.38820 -0.81483 -0.42663 3.66812 -1.26639 2.40172
magnitude: 2.44131 au
magnitude: 6.20532 debye
zeropoint: 0.32444244 hartree
thermalvibcorrection: 0.01694177 hartree
thermalrotcorrection: 0.00141627 hartree
thermaltrasncorrection: 0.00141627 hartree
thermaltotal: -1046.87815216 hartree
thermalcorr: 0.01977431 hartree
nonthermalcorr: 0.32444244 hartree
totalcorr: 0.34421675 hartree
totalenthalpy: -1046.87720796 hartree
