program: Orca
programVersion: 5.0.2
elementType: N H C C H H O C C O N H H H C C O H O H N H H H C H H C C C C H C H C H H O H
charge: 1
multiplicity: 1
keywords: wB97X-D3BJ Opt Freq def2-TZVPP def2/J RIJCOSX VeryTightSCF
keywords: PAL8 defgrid3 VeryTightOpt
frequency: 0.00 0.00 0.00 0.00 0.00 0.00 20.01 32.72 38.13 48.33 54.17 66.38 76.95 87.57 120.70 147.09 156.92 217.01 239.96 247.56 274.44 307.64 319.39 331.83 366.80 368.98 377.25 389.68 426.67 433.27 456.34 458.80 489.98 517.40 529.27 549.12 565.16 573.17 579.86 619.93 659.73 666.70 703.91 730.00 742.19 763.68 804.99 824.78 847.47 863.57 884.04 886.97 912.62 940.07 965.82 976.07 985.10 1001.89 1040.67 1045.95 1059.53 1120.59 1128.36 1144.36 1150.77 1188.63 1196.12 1197.42 1208.57 1233.04 1253.36 1267.18 1302.02 1307.74 1327.18 1335.85 1348.51 1358.32 1368.86 1385.02 1391.62 1412.96 1420.15 1437.36 1473.82 1498.58 1503.92 1505.96 1513.42 1565.84 1583.53 1613.74 1653.78 1681.09 1706.13 1725.54 1737.02 1813.04 1883.06 2577.57 3046.53 3082.17 3103.68 3142.18 3149.84 3157.39 3157.73 3175.85 3192.46 3217.29 3230.47 3494.08 3557.27 3629.78 3674.96 3847.23 3883.50
frequency: 20.01 32.72 38.13 48.33 54.17 66.38 76.95 87.57 120.70 147.09 156.92 217.01 239.96 247.56 274.44 307.64 319.39 331.83 366.80 368.98 377.25 389.68 426.67 433.27 456.34 458.80 489.98 517.40 529.27 549.12 565.16 573.17 579.86 619.93 659.73 666.70 703.91 730.00 742.19 763.68 804.99 824.78 847.47 863.57 884.04 886.97 912.62 940.07 965.82 976.07 985.10 1001.89 1040.67 1045.95 1059.53 1120.59 1128.36 1144.36 1150.77 1188.63 1196.12 1197.42 1208.57 1233.04 1253.36 1267.18 1302.02 1307.74 1327.18 1335.85 1348.51 1358.32 1368.86 1385.02 1391.62 1412.96 1420.15 1437.36 1473.82 1498.58 1503.92 1505.96 1513.42 1565.84 1583.53 1613.74 1653.78 1681.09 1706.13 1725.54 1737.02 1813.04 1883.06 2577.57 3046.53 3082.17 3103.68 3142.18 3149.84 3157.39 3157.73 3175.85 3192.46 3217.29 3230.47 3494.08 3557.27 3629.78 3674.96 3847.23 3883.50
formula: C13H18N3O5
InChI: InChI=1S/C13H18N3O5/c14-10(5-8-1-3-9(17)4-2-8)13(21)16-6-11(18)15-7-12(19)20/h1-4,10,15-17,19H,5-7H2,14H3
39 atoms
N  -2.287378 -2.131779 -1.301936
H  -2.851613 -1.299095 -1.321611
C  -2.412499 -3.069374 -2.394355
C  -1.421949 -2.732434 -3.513622
H  -2.214436 -4.079116 -2.030508
H  -3.433052 -3.037614 -2.778299
O  -0.681551 -1.793799 -3.461007
C  -1.211662 -2.152009 -0.511899
C  -1.020613 -0.987514 0.453629
O  -0.396013 -3.080644 -0.541101
N  -0.150856 0.052306 -0.07139
H  -0.665127 -1.396476 1.40305
H  -1.98246 -0.522502 0.667364
H  -0.561023 0.973918 -0.098829
C  1.224779 0.169988 -0.071366
C  2.172896 -1.030082 -0.204984
O  1.735125 1.262487 -0.104788
H  3.122926 -0.666986 0.183366
O  -1.431609 -3.558494 -4.564197
H  -2.072527 -4.270898 -4.467073
N  1.805656 -2.248174 0.602618
H  2.547566 -2.93989 0.501559
H  1.713557 -2.042509 1.595129
H  0.903976 -2.687948 0.222658
C  2.335542 -1.459552 -1.674053
H  1.371554 -1.778445 -2.071735
H  3.001655 -2.330574 -1.686683
C  2.91397 -0.361492 -2.529195
C  2.112933 0.33282 -3.425982
C  4.259201 -0.010982 -2.420212
C  2.637496 1.362691 -4.195353
H  1.069938 0.059808 -3.538968
C  4.795071 1.012604 -3.17765
H  4.908416 -0.550489 -1.736266
C  3.978849 1.707747 -4.069242
H  2.00337 1.894011 -4.8975
H  5.839572 1.286036 -3.099137
O  4.5544 2.703861 -4.789494
H  3.907068 3.106183 -5.373381
totalener: -1047.11756558 hartree
nucrepener: 1765.96377554 hartree
electener: -2813.08134111 hartree
oneelecener: -4916.64115275 hartree
twoeener: 2103.55981164 hartree
kineticenergy: 1042.87708451 hartree
exchangeener: -91.741657463773 hartree
correlationener: -6.623636762751 hartree
xcener: -98.365294226524 hartree
temp: 298.15 k
press: 1.00 atm
thermalcorrenthalpy: 0.00094421 hartree
totalenthalpy: -1046.85643097 hartree
totalentropycorr: -0.06772541 hartree
gibbsenthalpy: -1046.92415638 hartree
gibbsminuselec: 0.27712506 hartree
chargesum: 1.0000000
charge: -0.160849 0.192198 -0.137514 0.325395 0.142204 0.159036 -0.303358 0.332750 -0.186880 -0.395022 -0.173813 0.127826 0.135839 0.190584 0.152672 -0.024300 -0.252291 0.176307 -0.206413 0.220078 -0.076790 0.222254 0.215523 0.220449 -0.151491 0.117948 0.115687 -0.010349 -0.118923 -0.139576 -0.139640 0.118791 -0.155752 0.105108 0.205321 0.097503 0.128855 -0.281409 0.212041
charge: 0.358807 -0.004729 -0.042083 -0.437876 0.038711 0.036778 0.134734 -0.345676 -0.050204 0.150479 0.308469 0.024681 0.038988 -0.007152 -0.379462 -0.048691 0.159529 0.045972 0.400968 -0.091507 0.588629 0.044840 0.033559 -0.064747 -0.003340 0.033188 0.031937 -0.100623 0.005887 -0.001587 -0.017332 0.023582 0.006105 0.020378 -0.188601 0.017485 0.027515 0.360369 -0.107977
qa: -0.1608 0.1922 -0.1375 0.3254 0.1422 0.1590 -0.3034 0.3328 -0.1869 -0.3950 -0.1738 0.1278 0.1358 0.1906 0.1527 -0.0243 -0.2523 0.1763 -0.2064 0.2201 -0.0768 0.2223 0.2155 0.2204 -0.1515 0.1179 0.1157 -0.0103 -0.1189 -0.1396 -0.1396 0.1188 -0.1558 0.1051 0.2053 0.0975 0.1289 -0.2814 0.2120
va: 3.2974 1.0064 3.8121 4.2710 1.0050 0.9893 2.1652 4.0543 3.9224 2.1177 2.9957 1.0040 1.0031 1.0165 4.3606 3.7034 2.2540 1.0139 2.2683 1.0214 3.5391 0.9819 0.9815 1.1061 3.8283 1.0487 1.0083 3.6675 3.9862 4.0466 3.9472 1.0316 4.0505 1.0032 4.0599 1.0094 1.0121 2.2155 1.0291
dispcorr: -0.083716240 hartree
energy: -1047.201281385220
dipole: -2.29688 -0.83239 -3.12927 -5.41201 2.56174 -2.85027 6.72613 -3.69116 3.03497
magnitude: 5.20839 au
magnitude: 13.23869 debye
zeropoint: 0.32362886 hartree
thermalvibcorrection: 0.01744484 hartree
thermalrotcorrection: 0.00141627 hartree
thermaltrasncorrection: 0.00141627 hartree
thermaltotal: -1046.85737514 hartree
thermalcorr: 0.02027739 hartree
nonthermalcorr: 0.32362886 hartree
totalcorr: 0.34390625 hartree
totalenthalpy: -1046.85643093 hartree
