program: Orca
programVersion: 5.0.2
elementType: N H C C H H O C C O N H H H C C O H O H N H H H C H H C C C C H C H C H H O H
charge: 1
multiplicity: 1
keywords: wB97X-D3BJ Opt Freq def2-TZVPP def2/J RIJCOSX VeryTightSCF
keywords: PAL8 defgrid3 VeryTightOpt
frequency: 0.00 0.00 0.00 0.00 0.00 0.00 16.85 34.59 41.39 46.92 64.57 73.19 100.49 112.00 122.04 161.83 191.83 204.99 215.92 244.23 265.22 286.06 322.79 333.22 358.67 371.41 385.86 394.85 429.33 433.46 440.12 454.72 501.75 518.13 548.56 570.92 597.73 619.48 636.81 658.47 674.90 731.27 735.27 745.83 769.77 775.78 804.17 831.12 854.14 870.71 884.47 888.65 924.45 939.81 961.86 978.90 996.08 1014.45 1033.42 1042.39 1063.90 1076.92 1142.63 1143.78 1151.33 1158.70 1192.16 1208.92 1215.92 1222.75 1254.20 1268.28 1285.31 1304.06 1318.49 1333.76 1341.96 1359.77 1373.84 1374.82 1402.02 1412.63 1415.81 1462.24 1489.32 1490.04 1494.95 1500.07 1503.11 1508.69 1566.64 1581.17 1611.08 1671.78 1674.65 1701.01 1760.48 1801.71 1873.84 3087.56 3092.18 3126.14 3135.88 3157.24 3171.63 3201.84 3203.49 3205.60 3206.56 3233.39 3264.88 3388.67 3489.66 3580.91 3633.24 3672.05 3877.20
frequency: 16.85 34.59 41.39 46.92 64.57 73.19 100.49 112.00 122.04 161.83 191.83 204.99 215.92 244.23 265.22 286.06 322.79 333.22 358.67 371.41 385.86 394.85 429.33 433.46 440.12 454.72 501.75 518.13 548.56 570.92 597.73 619.48 636.81 658.47 674.90 731.27 735.27 745.83 769.77 775.78 804.17 831.12 854.14 870.71 884.47 888.65 924.45 939.81 961.86 978.90 996.08 1014.45 1033.42 1042.39 1063.90 1076.92 1142.63 1143.78 1151.33 1158.70 1192.16 1208.92 1215.92 1222.75 1254.20 1268.28 1285.31 1304.06 1318.49 1333.76 1341.96 1359.77 1373.84 1374.82 1402.02 1412.63 1415.81 1462.24 1489.32 1490.04 1494.95 1500.07 1503.11 1508.69 1566.64 1581.17 1611.08 1671.78 1674.65 1701.01 1760.48 1801.71 1873.84 3087.56 3092.18 3126.14 3135.88 3157.24 3171.63 3201.84 3203.49 3205.60 3206.56 3233.39 3264.88 3388.67 3489.66 3580.91 3633.24 3672.05 3877.20
formula: C13H18N3O5
InChI: InChI=1S/C13H18N3O5/c14-10(5-8-1-3-9(17)4-2-8)13(21)16-6-11(18)15-7-12(19)20/h1-4,10,15-17,19H,5-7H2,14H3
39 atoms
N  -0.304507 -2.850748 -2.06252
H  -0.570449 -3.495762 -1.337606
C  0.405536 -3.373926 -3.22817
C  1.901535 -3.15768 -2.973844
H  0.217746 -4.44063 -3.311473
H  0.063742 -2.867166 -4.130049
O  2.608071 -3.960835 -2.433544
C  -0.305854 -1.522668 -1.816031
C  -0.704626 -1.075758 -0.406047
O  0.095404 -0.707424 -2.633669
N  0.154838 0.01369 0.027133
H  -0.668427 -1.91067 0.297506
H  -1.731403 -0.711032 -0.421458
H  -0.215651 0.947532 -0.070445
C  1.506844 -0.022835 -0.066595
C  2.195355 -1.395696 -0.010644
O  2.205963 0.970597 -0.128415
H  1.678627 -2.143543 -0.601246
O  2.375937 -1.927868 -3.270849
H  1.633628 -1.327292 -3.478678
N  3.529612 -1.172789 -0.645611
H  4.271087 -1.665409 -0.145486
H  3.511729 -1.443195 -1.635926
H  3.695763 -0.153671 -0.563404
C  2.347274 -1.912132 1.440665
H  2.481646 -2.994632 1.395845
H  1.403633 -1.725562 1.957426
C  3.505979 -1.288604 2.177118
C  3.42148 -0.006062 2.725278
C  4.711875 -1.977172 2.286905
C  4.506252 0.571888 3.354908
H  2.492528 0.54961 2.666268
C  5.813081 -1.407189 2.914492
H  4.793269 -2.992323 1.906734
C  5.711705 -0.126703 3.449972
H  4.441207 1.562137 3.787505
H  6.739283 -1.964977 3.001727
O  6.734777 0.493703 4.079752
H  7.506085 -0.077565 4.119959
totalener: -1047.12590946 hartree
nucrepener: 1770.70403526 hartree
electener: -2817.82994472 hartree
oneelecener: -4924.05035840 hartree
twoeener: 2106.22041368 hartree
kineticenergy: 1041.97429609 hartree
exchangeener: -91.585286408309 hartree
correlationener: -6.619119864828 hartree
xcener: -98.204406273137 hartree
temp: 298.15 k
press: 1.00 atm
thermalcorrenthalpy: 0.00094421 hartree
totalenthalpy: -1046.87098487 hartree
totalentropycorr: -0.06267576 hartree
gibbsenthalpy: -1046.93366063 hartree
gibbsminuselec: 0.27898016 hartree
totalenthalpy: -1046.87333520 hartree
chargesum: 1.0000000
charge: -0.177155 0.198670 -0.122676 0.282116 0.148748 0.157725 -0.279933 0.227713 -0.116491 -0.374436 -0.177704 0.114817 0.152454 0.204485 0.199529 0.030641 -0.317129 0.080825 -0.291066 0.256199 -0.036029 0.227054 0.244458 0.235220 -0.186333 0.150705 0.133446 0.019891 -0.145112 -0.273527 -0.126869 0.129476 -0.124327 0.158559 0.187308 0.142448 0.117606 -0.268181 0.216874
charge: 0.335588 -0.015017 -0.022081 -0.446184 0.041479 0.035440 0.132588 -0.393506 -0.033266 0.116441 0.334151 0.024969 0.045740 0.001968 -0.377960 -0.039678 0.133209 0.021170 0.365259 -0.126482 0.622075 0.043369 0.023612 0.033973 0.005939 0.040461 0.041426 -0.117256 0.007141 -0.024236 0.016914 0.028574 -0.016309 0.024008 -0.188863 0.033025 0.022066 0.372253 -0.102003
qa: -0.1772 0.1987 -0.1227 0.2821 0.1487 0.1577 -0.2799 0.2277 -0.1165 -0.3744 -0.1777 0.1148 0.1525 0.2045 0.1995 0.0306 -0.3171 0.0808 -0.2911 0.2562 -0.0360 0.2271 0.2445 0.2352 -0.1863 0.1507 0.1334 0.0199 -0.1451 -0.2735 -0.1269 0.1295 -0.1243 0.1586 0.1873 0.1424 0.1176 -0.2682 0.2169
va: 3.1840 1.0032 3.8829 4.1831 1.0059 0.9990 2.2100 4.1104 3.9344 2.1323 3.1653 1.0007 0.9956 1.0076 4.2991 3.8270 2.1921 1.0590 2.1562 1.0306 3.6304 0.9997 1.0151 1.0166 3.8187 0.9924 1.0047 3.5730 4.0399 4.0057 3.9974 1.0034 3.9566 0.9986 4.1055 1.0089 1.0060 2.2338 1.0258
dispcorr: -0.087818541 hartree
energy: -1047.219241822643
dipole: -2.68553 1.34397 -1.34157 -4.32894 2.91132 -1.41761 2.34213 -2.76692 -0.42479
magnitude: 1.99747 au
magnitude: 5.07716 debye
zeropoint: 0.32499591 hartree
thermalvibcorrection: 0.01713557 hartree
thermalrotcorrection: 0.00141627 hartree
thermaltrasncorrection: 0.00141627 hartree
thermaltotal: -1046.87427780 hartree
thermalcorr: 0.01996811 hartree
nonthermalcorr: 0.32499591 hartree
totalcorr: 0.34496402 hartree
totalenthalpy: -1046.87333359 hartree
