program: Orca
programVersion: 5.0.2
elementType: N H C C H H O C C O N H H H C C O H O H N H H H C H H C C C C H C H C H H O H
charge: 1
multiplicity: 1
keywords: wB97X-D3BJ Opt Freq def2-TZVPP def2/J RIJCOSX VeryTightSCF
keywords: PAL8 defgrid3 VeryTightOpt
frequency: 0.00 0.00 0.00 0.00 0.00 0.00 14.14 26.43 34.56 45.84 57.78 71.26 76.44 99.04 117.00 151.97 161.77 189.34 206.17 234.04 260.89 293.45 305.30 332.80 344.79 362.93 379.31 404.73 410.32 428.10 434.93 492.56 515.28 526.26 533.10 562.30 575.67 615.21 618.36 645.76 659.70 664.50 714.36 733.99 748.51 779.94 796.45 801.02 854.32 864.74 869.57 880.82 916.42 946.19 965.76 990.57 1003.36 1008.86 1029.78 1037.67 1043.67 1103.46 1139.65 1158.70 1167.07 1178.22 1198.20 1207.15 1210.88 1235.10 1247.02 1265.30 1296.05 1316.84 1328.54 1330.19 1341.41 1357.79 1364.61 1372.84 1394.45 1421.36 1462.11 1470.21 1475.47 1489.68 1494.45 1501.08 1504.53 1525.99 1538.01 1581.33 1619.80 1676.83 1683.90 1703.73 1750.53 1798.52 1864.52 3069.40 3075.73 3077.71 3122.31 3132.63 3159.99 3176.23 3192.17 3192.70 3208.28 3227.97 3303.68 3433.27 3552.99 3572.07 3637.67 3796.71 3878.91
frequency: 14.14 26.43 34.56 45.84 57.78 71.26 76.44 99.04 117.00 151.97 161.77 189.34 206.17 234.04 260.89 293.45 305.30 332.80 344.79 362.93 379.31 404.73 410.32 428.10 434.93 492.56 515.28 526.26 533.10 562.30 575.67 615.21 618.36 645.76 659.70 664.50 714.36 733.99 748.51 779.94 796.45 801.02 854.32 864.74 869.57 880.82 916.42 946.19 965.76 990.57 1003.36 1008.86 1029.78 1037.67 1043.67 1103.46 1139.65 1158.70 1167.07 1178.22 1198.20 1207.15 1210.88 1235.10 1247.02 1265.30 1296.05 1316.84 1328.54 1330.19 1341.41 1357.79 1364.61 1372.84 1394.45 1421.36 1462.11 1470.21 1475.47 1489.68 1494.45 1501.08 1504.53 1525.99 1538.01 1581.33 1619.80 1676.83 1683.90 1703.73 1750.53 1798.52 1864.52 3069.40 3075.73 3077.71 3122.31 3132.63 3159.99 3176.23 3192.17 3192.70 3208.28 3227.97 3303.68 3433.27 3552.99 3572.07 3637.67 3796.71 3878.91
formula: C13H18N3O5
InChI: InChI=1S/C13H18N3O5/c14-10(5-8-1-3-9(17)4-2-8)13(21)16-6-11(18)15-7-12(19)20/h1-4,10,15-17,19H,5-7H2,14H3
39 atoms
N  -1.465561 -2.127276 -2.580331
H  -1.240115 -2.467587 -3.508241
C  -2.804074 -2.431734 -2.120012
C  -3.474786 -3.294329 -3.174995
H  -2.805364 -2.984783 -1.177637
H  -3.412913 -1.533376 -1.985842
O  -2.947406 -3.619483 -4.203041
C  -0.515204 -1.458065 -1.923013
C  -0.843383 -1.005241 -0.492363
O  0.593312 -1.245287 -2.413617
N  0.016083 0.063148 -0.041108
H  -0.774315 -1.873108 0.171624
H  -1.871724 -0.654246 -0.425272
H  -0.3532 1.001607 -0.070185
C  1.362045 0.021578 0.003466
C  2.078077 -1.336087 -0.007729
O  2.067886 1.012355 0.059154
H  1.429465 -2.174733 -0.238647
O  -4.710032 -3.62735 -2.802867
H  -5.106862 -4.166648 -3.501196
N  3.024289 -1.19266 -1.16543
H  3.718917 -1.935461 -1.203646
H  2.43584 -1.191745 -2.01427
H  3.485864 -0.281388 -1.073833
C  2.810829 -1.570865 1.309794
H  3.48826 -0.736274 1.49971
H  3.404853 -2.486719 1.233683
C  1.789032 -1.689675 2.415675
C  1.07051 -2.872919 2.590695
C  1.493622 -0.60473 3.232987
C  0.081071 -2.974805 3.552573
H  1.301253 -3.741444 1.979933
C  0.506672 -0.692402 4.204929
H  2.03902 0.325206 3.112902
C  -0.204028 -1.878442 4.366122
H  -0.465328 -3.897164 3.704823
H  0.294572 0.16008 4.841673
O  -1.179591 -2.033162 5.294647
H  -1.257113 -1.242205 5.834039
totalener: -1047.13841395 hartree
nucrepener: 1700.72974837 hartree
electener: -2747.86816232 hartree
oneelecener: -4785.75169929 hartree
twoeener: 2037.88353698 hartree
kineticenergy: 1041.99055761 hartree
exchangeener: -91.593786691258 hartree
correlationener: -6.613558754696 hartree
xcener: -98.207345445954 hartree
temp: 298.15 k
press: 1.00 atm
thermalcorrenthalpy: 0.00094421 hartree
totalenthalpy: -1046.87863454 hartree
totalentropycorr: -0.06427671 hartree
gibbsenthalpy: -1046.94291125 hartree
gibbsminuselec: 0.27775075 hartree
totalenthalpy: -1046.88040804 hartree
chargesum: 1.0000000
charge: -0.150917 0.204905 -0.096947 0.284772 0.135935 0.138758 -0.300038 0.292622 -0.104168 -0.443789 -0.139026 0.128281 0.137893 0.194443 0.143476 -0.018871 -0.329956 0.130107 -0.254465 0.249304 -0.048737 0.224314 0.256482 0.235537 -0.153985 0.133714 0.118298 0.075236 -0.246816 -0.184478 -0.126054 0.124809 -0.125065 0.140691 0.183277 0.139174 0.112369 -0.277878 0.216793
charge: 0.348285 -0.002583 -0.038017 -0.435426 0.034067 0.034256 0.132788 -0.372069 -0.042644 0.066990 0.346653 0.035866 0.036332 -0.000229 -0.390068 -0.051856 0.101655 0.030696 0.383883 -0.071965 0.615824 0.044241 0.020405 0.051311 -0.001453 0.040766 0.032799 -0.101740 -0.011705 0.008211 -0.000739 0.023089 -0.014081 0.030402 -0.192696 0.028300 0.021447 0.363411 -0.104407
qa: -0.1509 0.2049 -0.0969 0.2848 0.1359 0.1388 -0.3000 0.2926 -0.1042 -0.4438 -0.1390 0.1283 0.1379 0.1944 0.1435 -0.0189 -0.3300 0.1301 -0.2545 0.2493 -0.0487 0.2243 0.2565 0.2355 -0.1540 0.1337 0.1183 0.0752 -0.2468 -0.1845 -0.1261 0.1248 -0.1251 0.1407 0.1833 0.1392 0.1124 -0.2779 0.2168
va: 3.2024 1.0285 3.8581 4.3725 0.9921 0.9951 2.1922 4.1564 3.8638 2.0506 3.1257 1.0004 0.9986 1.0103 4.4019 3.9390 2.2052 1.0143 2.2426 1.0093 3.5929 0.9772 1.0063 0.9969 3.8783 1.0214 1.0056 3.5972 4.0086 4.0439 3.9685 1.0042 3.9150 1.0087 4.0864 1.0084 1.0063 2.2199 1.0257
dispcorr: -0.082859344 hartree
energy: -1047.226174322355
dipole: 5.80473 -4.97904 0.82568 -0.13659 -0.02613 -0.16272 3.40034 -4.31790 -0.91756
magnitude: 1.24505 au
magnitude: 3.16466 debye
zeropoint: 0.32446571 hartree
thermalvibcorrection: 0.01752277 hartree
thermalrotcorrection: 0.00141627 hartree
thermaltrasncorrection: 0.00141627 hartree
thermaltotal: -1046.88135330 hartree
thermalcorr: 0.02035531 hartree
nonthermalcorr: 0.32446571 hartree
totalcorr: 0.34482102 hartree
totalenthalpy: -1046.88040909 hartree
