program: Orca
programVersion: 5.0.2
elementType: N H C C H H O C C O N H H H C C O H O H N H H H C H H C C C C H C H C H H O H
charge: 1
multiplicity: 1
keywords: wB97X-D3BJ Opt Freq def2-TZVPP def2/J RIJCOSX VeryTightSCF
keywords: PAL8 defgrid3 VeryTightOpt
frequency: 0.00 0.00 0.00 0.00 0.00 0.00 27.90 36.19 41.13 47.12 78.48 84.79 98.85 106.87 119.92 151.15 175.55 188.92 242.74 246.05 252.00 284.31 316.03 323.43 366.28 375.20 380.91 413.99 418.75 429.48 441.04 456.24 506.67 513.94 524.67 546.61 565.02 598.21 621.97 646.86 659.53 662.16 673.10 705.48 748.08 752.22 785.10 823.52 835.06 856.69 874.32 883.95 887.79 910.63 962.78 982.69 983.98 1011.83 1018.64 1042.15 1076.07 1105.49 1143.86 1154.28 1173.15 1184.25 1199.67 1203.75 1207.13 1250.74 1270.77 1288.21 1301.12 1322.85 1332.57 1341.55 1346.35 1370.68 1373.78 1394.04 1405.21 1417.56 1455.05 1458.60 1475.46 1485.06 1494.78 1496.90 1509.85 1520.06 1525.18 1580.16 1602.65 1673.65 1681.09 1701.27 1756.90 1805.02 1818.18 3102.04 3103.63 3110.49 3125.61 3151.34 3165.09 3181.54 3183.60 3186.03 3204.23 3230.99 3364.56 3456.59 3513.35 3626.58 3645.80 3803.97 3877.49
frequency: 27.90 36.19 41.13 47.12 78.48 84.79 98.85 106.87 119.92 151.15 175.55 188.92 242.74 246.05 252.00 284.31 316.03 323.43 366.28 375.20 380.91 413.99 418.75 429.48 441.04 456.24 506.67 513.94 524.67 546.61 565.02 598.21 621.97 646.86 659.53 662.16 673.10 705.48 748.08 752.22 785.10 823.52 835.06 856.69 874.32 883.95 887.79 910.63 962.78 982.69 983.98 1011.83 1018.64 1042.15 1076.07 1105.49 1143.86 1154.28 1173.15 1184.25 1199.67 1203.75 1207.13 1250.74 1270.77 1288.21 1301.12 1322.85 1332.57 1341.55 1346.35 1370.68 1373.78 1394.04 1405.21 1417.56 1455.05 1458.60 1475.46 1485.06 1494.78 1496.90 1509.85 1520.06 1525.18 1580.16 1602.65 1673.65 1681.09 1701.27 1756.90 1805.02 1818.18 3102.04 3103.63 3110.49 3125.61 3151.34 3165.09 3181.54 3183.60 3186.03 3204.23 3230.99 3364.56 3456.59 3513.35 3626.58 3645.80 3803.97 3877.49
formula: C13H18N3O5
InChI: InChI=1S/C13H18N3O5/c14-10(5-8-1-3-9(17)4-2-8)13(21)16-6-11(18)15-7-12(19)20/h1-4,10,15-17,19H,5-7H2,14H3
39 atoms
N  -0.878412 -1.398663 2.591647
H  -1.010615 -2.065681 3.335836
C  -0.704727 -0.020424 2.957423
C  0.745852 0.434716 3.007808
H  -1.250857 0.656549 2.300797
H  -1.123464 0.141084 3.953474
O  1.711246 -0.286082 2.882851
C  -1.057752 -1.952519 1.356962
C  -0.909346 -1.103835 0.08828
O  -1.345229 -3.122006 1.22925
N  0.058155 -0.017985 0.081458
H  -1.884737 -0.657021 -0.1134
H  -0.730379 -1.812257 -0.718147
H  -0.304862 0.919946 -0.004093
C  1.405442 -0.017597 0.056982
C  2.255951 -1.304677 0.018634
O  2.02933 1.034899 0.041821
H  2.559302 -1.424316 -1.024945
O  0.817842 1.74286 3.20978
H  1.744166 2.018778 3.235905
N  3.496263 -0.899143 0.764082
H  3.239373 -0.755668 1.749392
H  4.206007 -1.629728 0.693991
H  3.811102 0.002365 0.397246
C  1.787771 -2.65419 0.56693
H  0.960179 -3.021804 -0.036016
H  1.427974 -2.530289 1.587334
C  2.929445 -3.646491 0.53704
C  3.632076 -3.960419 1.701636
C  3.339001 -4.231435 -0.65921
C  4.715819 -4.823306 1.677773
H  3.313402 -3.540401 2.65134
C  4.419694 -5.099275 -0.6994
H  2.79768 -4.025048 -1.577569
C  5.115076 -5.396714 0.472024
H  5.252607 -5.077498 2.582975
H  4.715794 -5.555346 -1.638131
O  6.177597 -6.233253 0.505429
H  6.345713 -6.6039 -0.364749
totalener: -1047.12443341 hartree
nucrepener: 1778.22172977 hartree
electener: -2825.34616318 hartree
oneelecener: -4939.83698924 hartree
twoeener: 2114.49082606 hartree
kineticenergy: 1041.97996031 hartree
exchangeener: -91.590419863900 hartree
correlationener: -6.616893113522 hartree
xcener: -98.207312977422 hartree
temp: 298.15 k
press: 1.00 atm
thermalcorrenthalpy: 0.00094421 hartree
totalenthalpy: -1046.86846319 hartree
totalentropycorr: -0.06353840 hartree
gibbsenthalpy: -1046.93200159 hartree
gibbsminuselec: 0.27878376 hartree
totalenthalpy: -1046.87041856 hartree
chargesum: 1.0000000
charge: -0.183743 0.201081 -0.143876 0.393238 0.132137 0.161110 -0.401569 0.201322 -0.128412 -0.295241 -0.172979 0.154841 0.147114 0.205123 0.136294 0.054767 -0.359978 0.167829 -0.227981 0.243521 -0.071148 0.241094 0.238799 0.235741 -0.182206 0.142867 0.137530 -0.043133 -0.202971 -0.175775 -0.140722 0.137958 -0.150760 0.133152 0.206950 0.144191 0.116236 -0.270083 0.217680
charge: 0.325270 -0.005620 -0.054863 -0.427081 0.036173 0.049251 0.099162 -0.404740 -0.038171 0.113974 0.335995 0.044721 0.035912 -0.002588 -0.385396 -0.035330 0.085257 0.048534 0.407098 -0.073327 0.618907 0.026999 0.043089 0.037267 -0.003877 0.040951 0.035025 -0.112029 -0.016908 -0.004599 0.005902 0.024960 -0.009097 0.026931 -0.190829 0.031369 0.023173 0.370568 -0.102033
qa: -0.1837 0.2011 -0.1439 0.3932 0.1321 0.1611 -0.4016 0.2013 -0.1284 -0.2952 -0.1730 0.1548 0.1471 0.2051 0.1363 0.0548 -0.3600 0.1678 -0.2280 0.2435 -0.0711 0.2411 0.2388 0.2357 -0.1822 0.1429 0.1375 -0.0431 -0.2030 -0.1758 -0.1407 0.1380 -0.1508 0.1332 0.2070 0.1442 0.1162 -0.2701 0.2177
va: 3.0581 1.0094 3.8968 4.1853 1.0093 0.9983 2.0898 4.2889 3.7404 2.2332 3.0869 0.9874 1.0125 1.0004 4.4000 3.7138 2.1545 0.9968 2.2906 1.0163 3.6510 1.0165 0.9808 1.0017 3.7813 1.0177 1.0290 3.5849 3.9689 4.0490 4.0151 1.0075 3.9591 1.0058 4.0819 1.0088 1.0077 2.2308 1.0255
dispcorr: -0.087485892 hartree
energy: -1047.216424107491
dipole: 0.34602 0.22168 0.56770 0.50167 1.36694 1.86861 -2.48736 2.13304 -0.35432
magnitude: 1.98482 au
magnitude: 5.04502 debye
zeropoint: 0.32491884 hartree
thermalvibcorrection: 0.01730983 hartree
thermalrotcorrection: 0.00141627 hartree
thermaltrasncorrection: 0.00141627 hartree
thermaltotal: -1046.87136289 hartree
thermalcorr: 0.02014237 hartree
nonthermalcorr: 0.32491884 hartree
totalcorr: 0.34506121 hartree
totalenthalpy: -1046.87041869 hartree
