program: Orca
programVersion: 5.0.2
elementType: N H C C H H O C C O N H H H C C O H O H N H H H C H H C C C C H C H C H H O H
charge: 1
multiplicity: 1
keywords: wB97X-D3BJ Opt Freq def2-TZVPP def2/J RIJCOSX VeryTightSCF
keywords: PAL8 defgrid3 VeryTightOpt
frequency: 0.00 0.00 0.00 0.00 0.00 0.00 23.93 40.08 50.93 55.35 62.76 76.74 94.66 106.51 125.65 142.79 162.30 211.67 224.18 253.11 273.85 317.08 329.09 332.45 339.30 368.58 379.01 403.29 427.97 430.74 434.65 470.95 512.82 534.96 553.12 565.45 577.00 619.39 626.46 648.81 659.21 682.13 705.88 743.53 755.86 769.22 800.28 808.73 852.30 862.36 874.84 883.16 900.45 962.29 965.63 977.93 991.13 1015.63 1022.87 1042.64 1044.87 1110.83 1140.00 1143.09 1159.77 1163.95 1196.81 1206.94 1230.07 1233.08 1238.68 1250.45 1281.37 1329.03 1332.32 1343.56 1354.91 1362.93 1372.44 1379.77 1390.96 1405.60 1410.99 1469.21 1481.06 1485.95 1487.91 1497.27 1501.91 1507.76 1539.41 1581.98 1612.58 1674.47 1687.96 1702.74 1781.01 1826.62 1840.10 3068.21 3100.60 3122.45 3125.85 3149.30 3180.10 3181.80 3192.35 3194.97 3202.68 3231.00 3273.78 3343.13 3553.43 3606.53 3630.47 3763.03 3878.38
frequency: 23.93 40.08 50.93 55.35 62.76 76.74 94.66 106.51 125.65 142.79 162.30 211.67 224.18 253.11 273.85 317.08 329.09 332.45 339.30 368.58 379.01 403.29 427.97 430.74 434.65 470.95 512.82 534.96 553.12 565.45 577.00 619.39 626.46 648.81 659.21 682.13 705.88 743.53 755.86 769.22 800.28 808.73 852.30 862.36 874.84 883.16 900.45 962.29 965.63 977.93 991.13 1015.63 1022.87 1042.64 1044.87 1110.83 1140.00 1143.09 1159.77 1163.95 1196.81 1206.94 1230.07 1233.08 1238.68 1250.45 1281.37 1329.03 1332.32 1343.56 1354.91 1362.93 1372.44 1379.77 1390.96 1405.60 1410.99 1469.21 1481.06 1485.95 1487.91 1497.27 1501.91 1507.76 1539.41 1581.98 1612.58 1674.47 1687.96 1702.74 1781.01 1826.62 1840.10 3068.21 3100.60 3122.45 3125.85 3149.30 3180.10 3181.80 3192.35 3194.97 3202.68 3231.00 3273.78 3343.13 3553.43 3606.53 3630.47 3763.03 3878.38
formula: C13H18N3O5
InChI: InChI=1S/C13H18N3O5/c14-10(5-8-1-3-9(17)4-2-8)13(21)16-6-11(18)15-7-12(19)20/h1-4,10,15-17,19H,5-7H2,14H3
39 atoms
N  -1.78481 -1.078649 -2.410737
H  -2.613448 -0.986391 -2.979634
C  -0.668757 -1.81804 -2.957987
C  0.620059 -1.005142 -3.014487
H  -0.456386 -2.743578 -2.422452
H  -0.9062 -2.09975 -3.986318
O  1.707923 -1.521798 -2.882755
C  -2.049452 -0.918827 -1.060414
C  -0.919575 -1.206893 -0.066152
O  -3.114391 -0.503222 -0.67899
N  -0.00087 -0.077965 -0.063716
H  -0.385553 -2.121778 -0.308827
H  -1.380606 -1.334747 0.912803
H  -0.415121 0.83863 0.042043
C  1.340272 -0.064143 0.008305
C  2.136823 -1.377695 0.040981
O  1.989907 0.969762 0.050978
H  1.645101 -2.205147 -0.460991
O  0.502102 0.294823 -3.221578
H  -0.433009 0.546237 -3.20661
N  3.363279 -1.046033 -0.756257
H  3.122084 -1.106182 -1.759318
H  3.585831 -0.064872 -0.528646
H  4.147588 -1.657122 -0.541069
C  2.50588 -1.75009 1.481597
H  3.046562 -0.915158 1.934347
H  3.17602 -2.614464 1.458006
C  1.264764 -2.071352 2.277529
C  0.70257 -3.342842 2.234988
C  0.621379 -1.082571 3.021452
C  -0.479126 -3.626748 2.905434
H  1.196111 -4.136328 1.681463
C  -0.55821 -1.348138 3.69412
H  1.050972 -0.087553 3.080557
C  -1.115446 -2.625963 3.637403
H  -0.89711 -4.627347 2.873396
H  -1.055199 -0.585706 4.280565
O  -2.267689 -2.828499 4.316831
H  -2.544469 -3.745988 4.25115
totalener: -1047.12201929 hartree
nucrepener: 1814.95185549 hartree
electener: -2862.07387478 hartree
oneelecener: -5012.48109838 hartree
twoeener: 2150.40722360 hartree
kineticenergy: 1041.98854016 hartree
exchangeener: -91.585321035610 hartree
correlationener: -6.618270043331 hartree
xcener: -98.203591078942 hartree
temp: 298.15 k
press: 1.00 atm
thermalcorrenthalpy: 0.00094421 hartree
totalenthalpy: -1046.86840314 hartree
totalentropycorr: -0.06307636 hartree
gibbsenthalpy: -1046.93147950 hartree
gibbsminuselec: 0.27881654 hartree
chargesum: 1.0000000
charge: -0.268518 0.214664 -0.088442 0.308410 0.131170 0.155782 -0.379712 0.164412 -0.069003 -0.263136 -0.159017 0.107626 0.151306 0.206561 0.180003 -0.025270 -0.341221 0.149051 -0.193171 0.236923 -0.047615 0.243315 0.233450 0.223379 -0.170351 0.142184 0.117433 0.056582 -0.234950 -0.185898 -0.118902 0.128019 -0.120998 0.140937 0.167413 0.115289 0.144576 -0.268756 0.216475
charge: 0.299841 -0.011860 -0.054148 -0.434035 0.031193 0.049665 0.119829 -0.381548 -0.028024 0.141502 0.350726 0.018681 0.042089 0.008045 -0.392812 -0.050547 0.104949 0.024381 0.416612 -0.089955 0.614961 0.009431 0.036343 0.042770 -0.000152 0.042907 0.034615 -0.107969 -0.008280 0.002925 -0.018921 0.024776 0.005171 0.030342 -0.196222 0.021297 0.032188 0.371943 -0.102709
qa: -0.2685 0.2147 -0.0884 0.3084 0.1312 0.1558 -0.3797 0.1644 -0.0690 -0.2631 -0.1590 0.1076 0.1513 0.2066 0.1800 -0.0253 -0.3412 0.1491 -0.1932 0.2369 -0.0476 0.2433 0.2334 0.2234 -0.1704 0.1422 0.1174 0.0566 -0.2349 -0.1859 -0.1189 0.1280 -0.1210 0.1409 0.1674 0.1153 0.1446 -0.2688 0.2165
va: 3.0117 0.9977 3.8593 4.2205 1.0081 0.9937 2.1225 4.3638 3.7425 2.2426 3.0987 1.0030 1.0279 1.0067 4.2743 3.9195 2.1880 1.0121 2.2728 1.0240 3.5923 1.0286 1.0144 0.9788 3.8689 1.0110 1.0068 3.5595 4.0176 4.0037 3.9056 1.0049 3.9400 1.0042 4.1032 1.0065 1.0094 2.2308 1.0261
dispcorr: -0.088585224 hartree
energy: -1047.216336382846
dipole: 6.16936 -4.20254 1.96682 -5.80470 4.30103 -1.50367 0.15948 -2.00051 -1.84103
magnitude: 3.08525 au
magnitude: 7.84209 debye
zeropoint: 0.32488975 hartree
thermalvibcorrection: 0.01714908 hartree
thermalrotcorrection: 0.00141627 hartree
thermaltrasncorrection: 0.00141627 hartree
thermaltotal: -1046.87146501 hartree
thermalcorr: 0.01998162 hartree
nonthermalcorr: 0.32488975 hartree
totalcorr: 0.34487137 hartree
totalenthalpy: -1046.87052080 hartree
