program: Orca
programVersion: 5.0.2
elementType: N H C C H H O C C O N H H H C C O H O H N H H H C H H C C C C H C H C H H O H
charge: 1
multiplicity: 1
keywords: wB97X-D3BJ Opt Freq def2-TZVPP def2/J RIJCOSX VeryTightSCF
keywords: PAL8 defgrid3 VeryTightOpt
frequency: 0.00 0.00 0.00 0.00 0.00 0.00 20.08 24.87 35.02 49.57 55.91 68.05 78.74 87.30 92.73 124.93 154.69 187.99 201.95 275.52 281.20 298.32 312.50 325.35 367.20 381.00 385.37 408.24 421.06 429.92 433.64 480.89 504.31 525.12 533.00 556.75 587.76 611.19 636.15 658.78 665.85 688.19 726.83 743.88 755.11 774.06 801.44 846.21 858.27 870.52 875.27 889.53 892.59 907.34 953.01 967.84 980.06 1012.39 1017.71 1041.81 1062.77 1093.48 1125.05 1148.74 1152.93 1165.16 1195.54 1202.43 1205.82 1249.05 1256.03 1265.13 1295.30 1303.03 1331.54 1334.98 1346.28 1354.32 1368.42 1381.49 1398.48 1430.00 1453.24 1457.44 1470.50 1488.61 1495.24 1499.89 1507.55 1520.79 1539.84 1580.11 1638.05 1667.25 1671.77 1700.93 1765.82 1798.62 1844.62 3086.69 3089.49 3126.45 3143.62 3153.24 3159.62 3163.16 3178.60 3180.66 3185.70 3203.94 3230.29 3392.87 3554.94 3585.64 3642.23 3794.41 3877.14
frequency: 20.08 24.87 35.02 49.57 55.91 68.05 78.74 87.30 92.73 124.93 154.69 187.99 201.95 275.52 281.20 298.32 312.50 325.35 367.20 381.00 385.37 408.24 421.06 429.92 433.64 480.89 504.31 525.12 533.00 556.75 587.76 611.19 636.15 658.78 665.85 688.19 726.83 743.88 755.11 774.06 801.44 846.21 858.27 870.52 875.27 889.53 892.59 907.34 953.01 967.84 980.06 1012.39 1017.71 1041.81 1062.77 1093.48 1125.05 1148.74 1152.93 1165.16 1195.54 1202.43 1205.82 1249.05 1256.03 1265.13 1295.30 1303.03 1331.54 1334.98 1346.28 1354.32 1368.42 1381.49 1398.48 1430.00 1453.24 1457.44 1470.50 1488.61 1495.24 1499.89 1507.55 1520.79 1539.84 1580.11 1638.05 1667.25 1671.77 1700.93 1765.82 1798.62 1844.62 3086.69 3089.49 3126.45 3143.62 3153.24 3159.62 3163.16 3178.60 3180.66 3185.70 3203.94 3230.29 3392.87 3554.94 3585.64 3642.23 3794.41 3877.14
formula: C13H18N3O5
InChI: InChI=1S/C13H18N3O5/c14-10(5-8-1-3-9(17)4-2-8)13(21)16-6-11(18)15-7-12(19)20/h1-4,10,15-17,19H,5-7H2,14H3
39 atoms
N  -2.746281 -1.042941 1.766644
H  -3.009003 -1.133311 2.736116
C  -3.736357 -0.515045 0.860055
C  -3.490479 0.933255 0.461666
H  -3.803949 -1.099976 -0.061734
H  -4.714883 -0.588635 1.331838
O  -2.421609 1.487386 0.515583
C  -1.417705 -1.215878 1.556928
C  -0.861578 -1.047472 0.137814
O  -0.65998 -1.520689 2.457192
N  0.055752 0.07424 0.087108
H  -1.633463 -0.897305 -0.614505
H  -0.342865 -1.974194 -0.101143
H  -0.37611 0.985622 0.181629
C  1.388937 0.070391 0.066162
C  2.16411 -1.259211 0.06998
O  2.065165 1.095628 0.054157
H  1.730101 -2.022502 -0.572616
O  -4.603616 1.499953 0.000633
H  -4.400402 2.403992 -0.27773
N  3.501127 -0.880247 -0.495585
H  4.23924 -1.428341 -0.040693
H  3.559409 -1.006932 -1.503061
H  3.56529 0.139972 -0.284757
C  2.378715 -1.786287 1.499654
H  1.413442 -2.111531 1.886881
H  2.695342 -0.949915 2.128442
C  3.413933 -2.88279 1.519565
C  4.697376 -2.646896 2.004596
C  3.12641 -4.149614 1.000931
C  5.67402 -3.637956 1.975508
H  4.93921 -1.683682 2.444754
C  4.084278 -5.143358 0.9648
H  2.126879 -4.369419 0.63814
C  5.368928 -4.889697 1.453325
H  6.663445 -3.437651 2.372565
H  3.859243 -6.128805 0.576694
O  6.261428 -5.904586 1.391926
H  7.097706 -5.645357 1.787311
totalener: -1047.13406213 hartree
nucrepener: 1669.61088992 hartree
electener: -2716.74495204 hartree
oneelecener: -4723.99102737 hartree
twoeener: 2007.24607533 hartree
kineticenergy: 1041.97758570 hartree
exchangeener: -91.589098721756 hartree
correlationener: -6.613992516926 hartree
xcener: -98.203091238681 hartree
temp: 298.15 k
press: 1.00 atm
thermalcorrenthalpy: 0.00094421 hartree
totalenthalpy: -1046.87392865 hartree
totalentropycorr: -0.06420388 hartree
gibbsenthalpy: -1046.93813253 hartree
gibbsminuselec: 0.27733985 hartree
totalenthalpy: -1046.87570305 hartree
chargesum: 1.0000000
charge: -0.177360 0.196648 -0.120793 0.340105 0.132432 0.148471 -0.349610 0.252850 -0.131444 -0.366182 -0.145822 0.140340 0.113128 0.221727 0.221445 0.009146 -0.367577 0.141731 -0.245607 0.246678 -0.058831 0.228878 0.226502 0.231227 -0.192274 0.161899 0.131686 -0.013778 -0.235012 -0.162442 -0.136091 0.159049 -0.132630 0.125677 0.197849 0.118625 0.142599 -0.270759 0.217521
charge: 0.331915 -0.003814 -0.051655 -0.432339 0.035972 0.044924 0.114486 -0.385902 -0.031082 0.097313 0.360078 0.024432 0.030478 -0.004201 -0.374191 -0.039471 0.099715 0.026195 0.389007 -0.073744 0.615442 0.037241 0.045163 0.015379 0.006815 0.035011 0.043998 -0.115791 -0.019604 -0.002487 -0.015912 0.025915 0.013669 0.025559 -0.190720 0.022346 0.031874 0.370048 -0.102060
qa: -0.1774 0.1966 -0.1208 0.3401 0.1324 0.1485 -0.3496 0.2529 -0.1314 -0.3662 -0.1458 0.1403 0.1131 0.2217 0.2214 0.0091 -0.3676 0.1417 -0.2456 0.2467 -0.0588 0.2289 0.2265 0.2312 -0.1923 0.1619 0.1317 -0.0138 -0.2350 -0.1624 -0.1361 0.1590 -0.1326 0.1257 0.1978 0.1186 0.1426 -0.2708 0.2175
va: 3.1484 1.0093 3.8734 4.2111 0.9985 1.0070 2.1178 4.2593 3.9062 2.1419 3.2133 1.0007 1.0120 1.0170 4.3158 3.8464 2.1531 0.9968 2.2574 1.0118 3.6319 1.0090 0.9805 1.0384 3.7588 1.0542 1.0201 3.5609 3.9819 4.0386 3.9483 1.0008 4.0017 1.0044 4.0908 1.0063 1.0091 2.2301 1.0254
dispcorr: -0.082190774 hartree
energy: -1047.221319971923
dipole: 3.87623 -3.61562 0.26061 -3.37171 3.56107 0.18936 -3.29022 1.26423 -2.02599
magnitude: 2.05144 au
magnitude: 5.21435 debye
zeropoint: 0.32436080 hartree
thermalvibcorrection: 0.01747799 hartree
thermalrotcorrection: 0.00141627 hartree
thermaltrasncorrection: 0.00141627 hartree
thermaltotal: -1046.87664864 hartree
thermalcorr: 0.02031053 hartree
nonthermalcorr: 0.32436080 hartree
totalcorr: 0.34467133 hartree
totalenthalpy: -1046.87570443 hartree
