program: Orca
programVersion: 5.0.2
elementType: N H C C H H O C C O N H H H C C O H O H N H H H C H H C C C C H C H C H H O H
charge: 1
multiplicity: 1
keywords: wB97X-D3BJ Opt Freq def2-TZVPP def2/J RIJCOSX VeryTightSCF
keywords: PAL8 defgrid3 VeryTightOpt
frequency: 0.00 0.00 0.00 0.00 0.00 0.00 22.80 25.10 33.31 41.99 58.44 61.96 69.68 89.49 103.04 126.33 168.69 198.33 225.77 245.78 262.14 301.16 315.90 329.10 351.62 362.92 387.98 413.34 429.11 433.44 441.16 452.62 503.43 528.27 544.24 556.37 579.03 607.69 628.64 645.56 658.10 659.20 715.50 738.13 749.63 755.78 802.55 831.61 845.19 857.76 872.11 891.26 901.96 909.05 965.00 980.97 988.50 1011.83 1015.36 1041.67 1080.13 1100.51 1138.46 1153.62 1157.75 1167.56 1196.08 1206.33 1218.77 1246.64 1255.77 1267.19 1291.10 1302.43 1334.06 1344.41 1357.28 1368.15 1374.02 1388.89 1397.87 1419.66 1438.21 1464.40 1478.25 1490.20 1494.46 1499.17 1502.03 1507.10 1536.62 1580.71 1615.48 1671.81 1678.25 1700.91 1779.10 1802.92 1822.25 3087.25 3113.17 3114.44 3136.56 3164.76 3179.53 3182.52 3184.26 3195.96 3204.93 3231.27 3343.22 3413.36 3459.25 3613.59 3642.49 3793.73 3875.90
frequency: 22.80 25.10 33.31 41.99 58.44 61.96 69.68 89.49 103.04 126.33 168.69 198.33 225.77 245.78 262.14 301.16 315.90 329.10 351.62 362.92 387.98 413.34 429.11 433.44 441.16 452.62 503.43 528.27 544.24 556.37 579.03 607.69 628.64 645.56 658.10 659.20 715.50 738.13 749.63 755.78 802.55 831.61 845.19 857.76 872.11 891.26 901.96 909.05 965.00 980.97 988.50 1011.83 1015.36 1041.67 1080.13 1100.51 1138.46 1153.62 1157.75 1167.56 1196.08 1206.33 1218.77 1246.64 1255.77 1267.19 1291.10 1302.43 1334.06 1344.41 1357.28 1368.15 1374.02 1388.89 1397.87 1419.66 1438.21 1464.40 1478.25 1490.20 1494.46 1499.17 1502.03 1507.10 1536.62 1580.71 1615.48 1671.81 1678.25 1700.91 1779.10 1802.92 1822.25 3087.25 3113.17 3114.44 3136.56 3164.76 3179.53 3182.52 3184.26 3195.96 3204.93 3231.27 3343.22 3413.36 3459.25 3613.59 3642.49 3793.73 3875.90
formula: C13H18N3O5
InChI: InChI=1S/C13H18N3O5/c14-10(5-8-1-3-9(17)4-2-8)13(21)16-6-11(18)15-7-12(19)20/h1-4,10,15-17,19H,5-7H2,14H3
39 atoms
N  -1.493298 -0.30717 -2.598459
H  -2.252945 -0.244814 -3.258788
C  -0.159581 -0.068826 -3.101636
C  0.652117 -1.330346 -3.350124
H  -0.25595 0.433697 -4.066086
H  0.422769 0.585063 -2.457519
O  1.792292 -1.492587 -2.964039
C  -1.867247 -0.939177 -1.439688
C  -0.815788 -1.21179 -0.354278
O  -3.00808 -1.287135 -1.250852
N  0.060609 -0.085543 -0.083965
H  -0.228379 -2.077054 -0.661299
H  -1.383946 -1.494611 0.531266
H  -0.371661 0.823663 0.006414
C  1.403367 -0.048084 -0.071286
C  2.198318 -1.354957 -0.010891
O  2.04202 0.994057 -0.05392
H  1.733502 -2.188688 -0.526198
O  -0.014472 -2.241529 -4.042964
H  0.555652 -3.006799 -4.202806
N  3.460396 -1.049447 -0.747413
H  4.209003 -1.678329 -0.444548
H  3.28133 -1.136025 -1.754067
H  3.686528 -0.06756 -0.534655
C  2.519988 -1.727692 1.444884
H  1.584444 -2.026062 1.922582
H  2.880035 -0.838076 1.966703
C  3.545798 -2.832524 1.503724
C  3.202257 -4.14702 1.173851
C  4.870608 -2.558982 1.83192
C  4.147276 -5.153976 1.169537
H  2.171756 -4.392861 0.935314
C  5.834184 -3.561787 1.831134
H  5.159332 -1.552845 2.121598
C  5.473891 -4.863674 1.498448
H  3.880902 -6.175426 0.928946
H  6.858407 -3.331091 2.103847
O  6.350889 -5.89219 1.477542
H  7.223295 -5.60204 1.756502
totalener: -1047.12842142 hartree
nucrepener: 1720.03284016 hartree
electener: -2767.16126158 hartree
oneelecener: -4822.86396572 hartree
twoeener: 2055.70270414 hartree
kineticenergy: 1041.97649744 hartree
exchangeener: -91.587447169873 hartree
correlationener: -6.613416963748 hartree
xcener: -98.200864133622 hartree
temp: 298.15 k
press: 1.00 atm
thermalcorrenthalpy: 0.00094421 hartree
totalenthalpy: -1046.86952406 hartree
totalentropycorr: -0.06408923 hartree
gibbsenthalpy: -1046.93361329 hartree
gibbsminuselec: 0.27803700 hartree
totalenthalpy: -1046.87160673 hartree
chargesum: 1.0000000
charge: -0.203378 0.203413 -0.093999 0.338414 0.155907 0.124842 -0.400252 0.185213 -0.109108 -0.281772 -0.195098 0.106186 0.173647 0.212722 0.205132 0.000194 -0.350802 0.139160 -0.219958 0.241494 -0.059912 0.233250 0.248048 0.227359 -0.176612 0.135778 0.141241 -0.003540 -0.154226 -0.248240 -0.136402 0.125625 -0.125146 0.152986 0.193696 0.144079 0.120001 -0.268393 0.218447
charge: 0.316036 -0.005374 -0.048751 -0.421344 0.049349 0.028990 0.090924 -0.392457 -0.030943 0.129269 0.346164 0.025055 0.040116 0.005761 -0.399281 -0.052941 0.097388 0.021465 0.407283 -0.070896 0.620441 0.040121 0.020039 0.036867 0.008043 0.044091 0.044357 -0.117505 -0.003820 -0.017730 0.014288 0.025575 -0.014212 0.026129 -0.189658 0.032465 0.023083 0.372531 -0.100918
qa: -0.2034 0.2034 -0.0940 0.3384 0.1559 0.1248 -0.4003 0.1852 -0.1091 -0.2818 -0.1951 0.1062 0.1736 0.2127 0.2051 0.0002 -0.3508 0.1392 -0.2200 0.2415 -0.0599 0.2333 0.2480 0.2274 -0.1766 0.1358 0.1412 -0.0035 -0.1542 -0.2482 -0.1364 0.1256 -0.1251 0.1530 0.1937 0.1441 0.1200 -0.2684 0.2184
va: 3.0747 1.0084 3.9068 4.1549 0.9933 1.0137 2.0558 4.3574 3.7560 2.2378 3.1351 1.0033 1.0069 0.9963 4.2763 3.8792 2.1661 1.0147 2.2893 1.0157 3.6344 0.9945 1.0062 1.0188 3.8187 1.0094 1.0161 3.5660 4.0379 3.9941 4.0103 1.0041 3.9310 1.0019 4.0991 1.0088 1.0056 2.2338 1.0248
dispcorr: -0.084270417 hartree
energy: -1047.217561235631
dipole: 5.05757 -3.24141 1.81615 0.69614 -0.23480 0.46135 2.47571 -3.44199 -0.96628
magnitude: 2.10831 au
magnitude: 5.35889 debye
zeropoint: 0.32463972 hartree
thermalvibcorrection: 0.01753643 hartree
thermalrotcorrection: 0.00141627 hartree
thermaltrasncorrection: 0.00141627 hartree
thermaltotal: -1046.87255255 hartree
thermalcorr: 0.02036897 hartree
nonthermalcorr: 0.32463972 hartree
totalcorr: 0.34500869 hartree
totalenthalpy: -1046.87160834 hartree
