program: Orca
programVersion: 5.0.2
elementType: N H C C H H O C C O N H H H C C O H O H N H H H C H H C C C C H C H C H H O H
charge: 1
multiplicity: 1
keywords: wB97X-D3BJ Opt Freq def2-TZVPP def2/J RIJCOSX VeryTightSCF
keywords: PAL8 defgrid3 VeryTightOpt
frequency: 0.00 0.00 0.00 0.00 0.00 0.00 21.88 27.93 35.48 52.96 61.89 62.83 70.59 82.06 106.91 111.01 164.19 175.42 191.83 195.27 270.88 285.09 295.03 314.43 335.71 364.24 382.50 386.12 411.20 429.64 433.78 491.53 500.19 527.37 531.84 549.63 571.53 611.99 632.98 658.80 665.39 692.51 729.46 746.15 756.85 768.47 825.38 855.35 860.15 868.76 878.88 885.45 890.26 901.26 942.62 972.93 981.20 1009.70 1011.44 1039.41 1042.03 1070.53 1122.20 1144.59 1160.13 1164.26 1198.15 1201.68 1206.76 1246.48 1253.19 1262.87 1292.68 1313.42 1331.20 1334.79 1342.75 1354.15 1370.10 1383.33 1399.18 1420.09 1450.36 1457.19 1476.40 1486.03 1489.17 1494.47 1498.23 1506.36 1517.12 1579.44 1646.47 1660.11 1671.55 1700.29 1791.25 1830.87 1845.84 3088.04 3095.06 3127.87 3150.26 3165.33 3170.75 3178.49 3180.98 3188.64 3205.27 3230.81 3333.12 3502.57 3549.17 3554.85 3636.65 3794.00 3876.39
frequency: 21.88 27.93 35.48 52.96 61.89 62.83 70.59 82.06 106.91 111.01 164.19 175.42 191.83 195.27 270.88 285.09 295.03 314.43 335.71 364.24 382.50 386.12 411.20 429.64 433.78 491.53 500.19 527.37 531.84 549.63 571.53 611.99 632.98 658.80 665.39 692.51 729.46 746.15 756.85 768.47 825.38 855.35 860.15 868.76 878.88 885.45 890.26 901.26 942.62 972.93 981.20 1009.70 1011.44 1039.41 1042.03 1070.53 1122.20 1144.59 1160.13 1164.26 1198.15 1201.68 1206.76 1246.48 1253.19 1262.87 1292.68 1313.42 1331.20 1334.79 1342.75 1354.15 1370.10 1383.33 1399.18 1420.09 1450.36 1457.19 1476.40 1486.03 1489.17 1494.47 1498.23 1506.36 1517.12 1579.44 1646.47 1660.11 1671.55 1700.29 1791.25 1830.87 1845.84 3088.04 3095.06 3127.87 3150.26 3165.33 3170.75 3178.49 3180.98 3188.64 3205.27 3230.81 3333.12 3502.57 3549.17 3554.85 3636.65 3794.00 3876.39
formula: C13H18N3O5
InChI: InChI=1S/C13H18N3O5/c14-10(5-8-1-3-9(17)4-2-8)13(21)16-6-11(18)15-7-12(19)20/h1-4,10,15-17,19H,5-7H2,14H3
39 atoms
N  -1.621427 -0.176705 -3.062939
H  -1.328109 0.051346 -4.000953
C  -2.937547 0.260334 -2.662388
C  -2.921001 1.521934 -1.808845
H  -3.532407 0.442634 -3.555688
H  -3.470391 -0.510377 -2.098279
O  -1.979184 1.889502 -1.153886
C  -0.591076 -0.532894 -2.257685
C  -0.854175 -0.82945 -0.776773
O  0.547165 -0.648988 -2.669616
N  0.004307 0.010456 0.049241
H  -0.634498 -1.889961 -0.633384
H  -1.882143 -0.66483 -0.465866
H  -0.292587 0.979892 -0.00584
C  1.385949 -0.054363 0.029682
C  2.06185 -1.417003 0.264269
O  2.084042 0.927573 0.034225
H  3.055523 -1.167929 0.632873
O  -4.099076 2.14258 -1.843012
H  -4.059908 2.915674 -1.262575
N  1.371465 -2.106485 1.427531
H  1.716949 -3.075523 1.475264
H  1.566443 -1.630581 2.307447
H  0.359725 -2.111396 1.301227
C  2.209149 -2.414114 -0.889956
H  2.768038 -1.90379 -1.673861
H  1.243948 -2.662489 -1.326357
C  2.911098 -3.6579 -0.3995
C  2.187467 -4.813959 -0.098071
C  4.286745 -3.664692 -0.16946
C  2.80683 -5.941137 0.422021
H  1.121601 -4.852191 -0.308275
C  4.92094 -4.784152 0.343582
H  4.878615 -2.787262 -0.410442
C  4.181067 -5.928456 0.645564
H  2.247029 -6.841958 0.639432
H  5.99417 -4.774631 0.502151
O  4.738157 -7.05269 1.149975
H  5.69078 -6.955038 1.22746
totalener: -1047.10968154 hartree
nucrepener: 1684.41917514 hartree
electener: -2731.52885668 hartree
oneelecener: -4753.24856229 hartree
twoeener: 2021.71970561 hartree
kineticenergy: 1041.96163459 hartree
exchangeener: -91.574060543884 hartree
correlationener: -6.610678385197 hartree
xcener: -98.184738929081 hartree
temp: 298.15 k
press: 1.00 atm
thermalcorrenthalpy: 0.00094421 hartree
totalenthalpy: -1046.85024657 hartree
totalentropycorr: -0.06462323 hartree
gibbsenthalpy: -1046.91486980 hartree
gibbsminuselec: 0.27753398 hartree
totalenthalpy: -1046.85212796 hartree
chargesum: 1.0000000
charge: -0.184021 0.197373 -0.114655 0.331449 0.149218 0.128774 -0.339726 0.255859 -0.112886 -0.359370 -0.246202 0.082971 0.133616 0.204853 0.160810 -0.003990 -0.257014 0.181563 -0.247036 0.246889 -0.050931 0.237351 0.241971 0.225589 -0.159168 0.155304 0.109673 0.021064 -0.245821 -0.172042 -0.139637 0.148665 -0.141337 0.146408 0.200936 0.145627 0.118745 -0.269688 0.218816
charge: 0.330900 -0.003184 -0.050838 -0.434661 0.044380 0.035373 0.116251 -0.385900 -0.059506 0.104707 0.283111 0.014239 0.024346 -0.008807 -0.388557 -0.032129 0.154265 0.049130 0.387433 -0.073951 0.617554 0.045991 0.057054 0.043516 -0.002168 0.055307 0.028811 -0.114695 -0.027410 0.002958 0.003856 0.020961 -0.004691 0.031450 -0.190741 0.030991 0.024565 0.371273 -0.101185
qa: -0.1840 0.1974 -0.1147 0.3314 0.1492 0.1288 -0.3397 0.2559 -0.1129 -0.3594 -0.2462 0.0830 0.1336 0.2049 0.1608 -0.0040 -0.2570 0.1816 -0.2470 0.2469 -0.0509 0.2374 0.2420 0.2256 -0.1592 0.1553 0.1097 0.0211 -0.2458 -0.1720 -0.1396 0.1487 -0.1413 0.1464 0.2009 0.1456 0.1187 -0.2697 0.2188
va: 3.1813 1.0089 3.8703 4.2230 1.0074 0.9978 2.1296 4.2338 3.9555 2.1446 3.0161 1.0080 1.0064 1.0306 4.3935 3.6860 2.2380 1.0121 2.2569 1.0115 3.6416 1.0021 0.9696 0.9946 3.8565 1.0134 1.0192 3.4984 3.9564 4.0577 4.0228 0.9990 3.9454 1.0039 4.0890 1.0082 1.0066 2.2312 1.0247
dispcorr: -0.083479049 hartree
energy: -1047.198028770972
dipole: -0.89400 -0.51848 -1.41248 -6.47811 5.55979 -0.91832 3.63034 -1.75700 1.87334
magnitude: 2.51949 au
magnitude: 6.40403 debye
zeropoint: 0.32434351 hartree
thermalvibcorrection: 0.01777916 hartree
thermalrotcorrection: 0.00141627 hartree
thermaltrasncorrection: 0.00141627 hartree
thermaltotal: -1046.85307356 hartree
thermalcorr: 0.02061170 hartree
nonthermalcorr: 0.32434351 hartree
totalcorr: 0.34495521 hartree
totalenthalpy: -1046.85212935 hartree
