program: Orca
programVersion: 5.0.2
elementType: N H C C H H O C C O N H H H C C O H O H N H H H C H H C C C C H C H C H H O H
charge: 1
multiplicity: 1
keywords: wB97X-D3BJ Opt Freq def2-TZVPP def2/J RIJCOSX VeryTightSCF
keywords: PAL8 defgrid3 VeryTightOpt
frequency: 0.00 0.00 0.00 0.00 0.00 0.00 29.45 31.09 50.54 58.75 75.58 81.87 112.92 116.72 131.97 139.83 161.97 215.09 222.96 240.11 260.64 298.19 321.58 335.84 361.84 385.52 407.55 421.43 430.52 444.50 448.80 466.84 495.79 532.31 535.62 555.68 582.04 596.47 616.60 623.38 655.19 687.25 726.38 731.00 756.15 782.09 818.59 832.52 843.24 856.98 862.48 879.59 899.34 909.67 968.68 981.64 998.36 1016.15 1018.70 1041.63 1070.86 1108.17 1137.80 1152.01 1153.72 1162.30 1189.20 1212.57 1219.23 1235.75 1267.75 1271.90 1286.10 1318.71 1332.83 1346.48 1350.33 1374.13 1380.06 1383.38 1391.47 1407.08 1418.47 1424.16 1477.21 1497.76 1498.75 1510.21 1513.22 1521.98 1539.35 1585.66 1634.66 1670.24 1675.17 1706.74 1761.86 1794.92 1862.18 2906.47 3054.33 3105.70 3106.57 3120.80 3139.10 3158.63 3169.05 3195.25 3207.88 3216.36 3228.88 3491.45 3504.03 3577.58 3642.47 3834.43 3876.91
frequency: 29.45 31.09 50.54 58.75 75.58 81.87 112.92 116.72 131.97 139.83 161.97 215.09 222.96 240.11 260.64 298.19 321.58 335.84 361.84 385.52 407.55 421.43 430.52 444.50 448.80 466.84 495.79 532.31 535.62 555.68 582.04 596.47 616.60 623.38 655.19 687.25 726.38 731.00 756.15 782.09 818.59 832.52 843.24 856.98 862.48 879.59 899.34 909.67 968.68 981.64 998.36 1016.15 1018.70 1041.63 1070.86 1108.17 1137.80 1152.01 1153.72 1162.30 1189.20 1212.57 1219.23 1235.75 1267.75 1271.90 1286.10 1318.71 1332.83 1346.48 1350.33 1374.13 1380.06 1383.38 1391.47 1407.08 1418.47 1424.16 1477.21 1497.76 1498.75 1510.21 1513.22 1521.98 1539.35 1585.66 1634.66 1670.24 1675.17 1706.74 1761.86 1794.92 1862.18 2906.47 3054.33 3105.70 3106.57 3120.80 3139.10 3158.63 3169.05 3195.25 3207.88 3216.36 3228.88 3491.45 3504.03 3577.58 3642.47 3834.43 3876.91
formula: C13H18N3O5
InChI: InChI=1S/C13H18N3O5/c14-10(5-8-1-3-9(17)4-2-8)13(21)16-6-11(18)15-7-12(19)20/h1-4,10,15-17,19H,5-7H2,14H3
39 atoms
N  -1.762381 -1.078706 2.299778
H  -1.89685 -1.620411 3.139604
C  -1.762232 0.367444 2.411539
C  -2.597481 1.023166 1.312239
H  -2.204976 0.626107 3.375208
H  -0.760461 0.793768 2.382852
O  -2.144191 1.843413 0.559219
C  -1.307242 -1.82307 1.251639
C  -0.899181 -1.131141 -0.060144
O  -1.267592 -3.035177 1.307999
N  0.003414 0.005923 0.023481
H  -1.80513 -0.786579 -0.563372
H  -0.479887 -1.91806 -0.683812
H  -0.423727 0.929314 0.024526
C  1.332641 0.012173 0.013551
C  2.135253 -1.314828 -0.005901
O  1.990908 1.053195 -0.006785
H  2.000954 -1.774675 -0.986498
O  -3.862601 0.611154 1.199225
H  -4.063945 -0.084182 1.836095
N  3.560847 -0.829836 0.05736
H  3.99084 -1.05694 0.952627
H  4.143634 -1.190358 -0.693242
H  3.434053 0.219669 -0.020291
C  1.859039 -2.349969 1.080599
H  2.680164 -3.075663 1.050091
H  0.976494 -2.920231 0.791432
C  1.662671 -1.837669 2.49446
C  2.001205 -0.56263 2.931155
C  1.092188 -2.717232 3.421755
C  1.77115 -0.162426 4.245667
H  2.432782 0.177295 2.267567
C  0.85818 -2.336678 4.726726
H  0.804071 -3.712474 3.102786
C  1.197203 -1.047997 5.147895
H  2.042661 0.840025 4.55922
H  0.417197 -3.022482 5.439563
O  0.933788 -0.729054 6.437404
H  1.256784 0.152194 6.642229
totalener: -1047.10350452 hartree
nucrepener: 1840.65178863 hartree
electener: -2887.75529315 hartree
oneelecener: -5064.16532462 hartree
twoeener: 2176.41003147 hartree
kineticenergy: 1041.96088732 hartree
exchangeener: -91.582348792379 hartree
correlationener: -6.621209648697 hartree
xcener: -98.203558441076 hartree
temp: 298.15 k
press: 1.00 atm
thermalcorrenthalpy: 0.00094421 hartree
totalenthalpy: -1046.85295110 hartree
totalentropycorr: -0.06293064 hartree
gibbsenthalpy: -1046.91588174 hartree
gibbsminuselec: 0.27787443 hartree
totalenthalpy: -1046.85425918 hartree
chargesum: 1.0000000
charge: -0.213429 0.204219 -0.118410 0.280872 0.160866 0.118044 -0.292229 0.159816 -0.143303 -0.307992 -0.167888 0.176811 0.149287 0.223316 0.220601 0.002915 -0.350054 0.170608 -0.206923 0.229166 -0.069744 0.233139 0.237086 0.226625 -0.231800 0.137427 0.128796 0.102170 -0.198316 -0.159547 -0.187021 0.106550 -0.194267 0.144295 0.214348 0.117706 0.150548 -0.272252 0.217962
charge: 0.317676 -0.010037 -0.057236 -0.446527 0.041073 0.026143 0.142772 -0.394059 -0.027414 0.109539 0.357957 0.046584 0.037005 -0.011113 -0.367259 -0.032340 0.124723 0.043476 0.401455 -0.091918 0.608174 0.047061 0.042624 -0.012618 -0.006304 0.038006 0.040360 -0.107363 -0.029376 0.013614 -0.021991 0.014169 0.005979 0.035763 -0.198117 0.021498 0.033017 0.368016 -0.103009
qa: -0.2134 0.2042 -0.1184 0.2809 0.1609 0.1180 -0.2922 0.1598 -0.1433 -0.3080 -0.1679 0.1768 0.1493 0.2233 0.2206 0.0029 -0.3501 0.1706 -0.2069 0.2292 -0.0697 0.2331 0.2371 0.2266 -0.2318 0.1374 0.1288 0.1022 -0.1983 -0.1595 -0.1870 0.1066 -0.1943 0.1443 0.2143 0.1177 0.1505 -0.2723 0.2180
va: 3.0453 1.0042 3.8544 4.3183 0.9850 1.0120 2.1779 4.3241 3.7578 2.2023 3.1941 0.9913 1.0103 1.0281 4.2511 3.8257 2.1672 0.9865 2.2678 1.0174 3.6055 0.9781 0.9729 1.0581 3.7955 0.9924 1.0377 3.4912 3.8970 4.0317 3.9980 1.0525 3.9755 1.0083 4.0363 1.0081 1.0059 2.2252 1.0247
dispcorr: -0.090501625 hartree
energy: -1047.199581917258
dipole: 8.47764 -5.45085 3.02679 -4.03939 3.40463 -0.63475 -1.68511 0.77529 -0.90982
magnitude: 3.22369 au
magnitude: 8.19396 debye
zeropoint: 0.32449281 hartree
thermalvibcorrection: 0.01705331 hartree
thermalrotcorrection: 0.00141627 hartree
thermaltrasncorrection: 0.00141627 hartree
thermaltotal: -1046.85520325 hartree
thermalcorr: 0.01988585 hartree
nonthermalcorr: 0.32449281 hartree
totalcorr: 0.34437866 hartree
totalenthalpy: -1046.85425904 hartree
