program: Orca
programVersion: 5.0.2
elementType: N H C C H H O C C O N H H H C C O H O H N H H H C H H C C C C H C H C H H O H
charge: 1
multiplicity: 1
keywords: wB97X-D3BJ Opt Freq def2-TZVPP def2/J RIJCOSX VeryTightSCF
keywords: PAL8 defgrid3 VeryTightOpt
frequency: 0.00 0.00 0.00 0.00 0.00 0.00 14.03 20.24 36.61 42.70 54.33 71.23 78.17 88.45 105.58 112.51 165.43 178.17 188.33 210.99 254.34 269.81 286.48 332.32 370.31 389.41 390.10 427.75 428.07 432.05 434.93 469.66 516.42 529.08 559.72 568.99 572.30 606.74 625.45 654.30 658.18 671.77 716.93 744.16 756.50 782.97 795.60 838.91 856.35 869.17 870.96 884.35 914.14 926.05 969.91 978.18 984.74 1012.60 1029.74 1042.39 1055.26 1122.22 1138.81 1140.41 1147.17 1153.08 1192.69 1207.69 1218.69 1224.49 1252.97 1260.57 1285.40 1313.14 1334.15 1342.09 1354.51 1364.83 1372.90 1376.59 1398.21 1418.35 1439.99 1447.63 1486.73 1494.33 1498.73 1503.12 1506.24 1515.69 1528.81 1580.94 1604.85 1670.58 1675.30 1701.19 1777.26 1820.92 1834.91 3036.42 3099.04 3105.79 3123.58 3135.69 3160.50 3172.45 3179.06 3180.75 3198.53 3205.10 3232.51 3383.29 3569.58 3607.88 3641.64 3792.70 3875.78
frequency: 14.03 20.24 36.61 42.70 54.33 71.23 78.17 88.45 105.58 112.51 165.43 178.17 188.33 210.99 254.34 269.81 286.48 332.32 370.31 389.41 390.10 427.75 428.07 432.05 434.93 469.66 516.42 529.08 559.72 568.99 572.30 606.74 625.45 654.30 658.18 671.77 716.93 744.16 756.50 782.97 795.60 838.91 856.35 869.17 870.96 884.35 914.14 926.05 969.91 978.18 984.74 1012.60 1029.74 1042.39 1055.26 1122.22 1138.81 1140.41 1147.17 1153.08 1192.69 1207.69 1218.69 1224.49 1252.97 1260.57 1285.40 1313.14 1334.15 1342.09 1354.51 1364.83 1372.90 1376.59 1398.21 1418.35 1439.99 1447.63 1486.73 1494.33 1498.73 1503.12 1506.24 1515.69 1528.81 1580.94 1604.85 1670.58 1675.30 1701.19 1777.26 1820.92 1834.91 3036.42 3099.04 3105.79 3123.58 3135.69 3160.50 3172.45 3179.06 3180.75 3198.53 3205.10 3232.51 3383.29 3569.58 3607.88 3641.64 3792.70 3875.78
formula: C13H18N3O5
InChI: InChI=1S/C13H18N3O5/c14-10(5-8-1-3-9(17)4-2-8)13(21)16-6-11(18)15-7-12(19)20/h1-4,10,15-17,19H,5-7H2,14H3
39 atoms
N  -2.680293 -0.451387 1.359247
H  -3.658753 -0.233728 1.472144
C  -1.908492 -0.749204 2.550209
C  -1.912488 -2.239905 2.860389
H  -0.875092 -0.431305 2.426408
H  -2.340504 -0.199405 3.385157
O  -1.007778 -2.987104 2.576704
C  -2.314856 -0.700666 0.067494
C  -0.859879 -1.108724 -0.191596
O  -3.083294 -0.578458 -0.857722
N  0.032282 0.022624 0.072584
H  -0.824117 -1.399373 -1.241871
H  -0.591467 -1.958638 0.433936
H  -0.35684 0.949194 -0.040109
C  1.370958 0.000296 0.021001
C  2.092573 -1.361904 0.046683
O  2.059679 1.012142 -0.040202
H  1.722759 -1.989226 -0.764413
O  -3.047285 -2.628696 3.439878
H  -3.018629 -3.586969 3.570733
N  3.518795 -0.995047 -0.243994
H  4.117231 -1.260278 0.546259
H  3.877751 -1.383607 -1.111356
H  3.484221 0.05417 -0.286937
C  2.014699 -2.112249 1.394815
H  2.316427 -3.147095 1.220959
H  0.978543 -2.151002 1.727492
C  2.90156 -1.492841 2.446488
C  4.102672 -2.100859 2.804161
C  2.568879 -0.27905 3.056639
C  4.95488 -1.523548 3.739451
H  4.370432 -3.061827 2.37389
C  3.403806 0.306696 3.986621
H  1.637356 0.217222 2.80656
C  4.606276 -0.31515 4.333509
H  5.878112 -2.02204 4.014482
H  3.144554 1.243129 4.464062
O  5.376288 0.30785 5.252597
H  6.163047 -0.20865 5.445892
totalener: -1047.11691588 hartree
nucrepener: 1738.51296552 hartree
electener: -2785.62988140 hartree
oneelecener: -4860.56236967 hartree
twoeener: 2074.93248827 hartree
kineticenergy: 1041.96478359 hartree
exchangeener: -91.580773746517 hartree
correlationener: -6.614030738599 hartree
xcener: -98.194804485116 hartree
temp: 298.15 k
press: 1.00 atm
thermalcorrenthalpy: 0.00094421 hartree
totalenthalpy: -1046.85942040 hartree
totalentropycorr: -0.06424268 hartree
gibbsenthalpy: -1046.92366309 hartree
gibbsminuselec: 0.27717822 hartree
totalenthalpy: -1046.86120242 hartree
chargesum: 1.0000000
charge: -0.209512 0.207866 -0.031919 0.303392 0.063789 0.154898 -0.335064 0.148432 -0.119064 -0.282933 -0.189654 0.152937 0.139305 0.210606 0.211886 -0.021291 -0.337150 0.156487 -0.246919 0.243359 -0.045083 0.226483 0.231472 0.229751 -0.121983 0.135025 0.098995 0.035609 -0.255340 -0.179302 -0.124401 0.158501 -0.127535 0.116166 0.187368 0.120003 0.143452 -0.266702 0.218070
charge: 0.322660 -0.005085 -0.048891 -0.437169 0.020651 0.039748 0.106736 -0.396193 -0.026058 0.123593 0.341665 0.031819 0.019020 0.006645 -0.374113 -0.031074 0.127372 0.036817 0.386165 -0.074231 0.615283 0.038283 0.039630 0.005130 0.004681 0.040533 0.028474 -0.116123 -0.020552 0.000648 -0.014080 0.025317 0.018084 0.023783 -0.188626 0.023000 0.033068 0.373991 -0.100602
qa: -0.2095 0.2079 -0.0319 0.3034 0.0638 0.1549 -0.3351 0.1484 -0.1191 -0.2829 -0.1897 0.1529 0.1393 0.2106 0.2119 -0.0213 -0.3372 0.1565 -0.2469 0.2434 -0.0451 0.2265 0.2315 0.2298 -0.1220 0.1350 0.0990 0.0356 -0.2553 -0.1793 -0.1244 0.1585 -0.1275 0.1162 0.1874 0.1200 0.1435 -0.2667 0.2181
va: 3.1004 1.0048 3.8825 4.2467 1.0245 1.0020 2.1126 4.3835 3.7330 2.2341 3.1404 1.0153 1.0077 1.0008 4.2256 3.8970 2.1748 0.9933 2.2616 1.0135 3.5960 1.0129 0.9759 1.0436 3.7835 1.0099 1.0814 3.5421 4.0103 4.0767 3.9570 1.0007 4.0206 1.0040 4.1080 1.0057 1.0085 2.2360 1.0250
dispcorr: -0.084399052 hartree
energy: -1047.206713508396
dipole: 7.48389 -4.99031 2.49358 -3.16592 1.98728 -1.17864 -2.15940 1.30708 -0.85233
magnitude: 2.88680 au
magnitude: 7.33765 debye
zeropoint: 0.32407011 hartree
thermalvibcorrection: 0.01766526 hartree
thermalrotcorrection: 0.00141627 hartree
thermaltrasncorrection: 0.00141627 hartree
thermaltotal: -1046.86214560 hartree
thermalcorr: 0.02049780 hartree
nonthermalcorr: 0.32407011 hartree
totalcorr: 0.34456791 hartree
totalenthalpy: -1046.86120139 hartree
