program: Orca
programVersion: 5.0.2
elementType: N H C C H H O C C O N H H H C C O H O H N H H H C H H C C C C H C H C H H O H
charge: 1
multiplicity: 1
keywords: wB97X-D3BJ Opt Freq def2-TZVPP def2/J RIJCOSX VeryTightSCF
keywords: PAL8 defgrid3 VeryTightOpt
frequency: 0.00 0.00 0.00 0.00 0.00 0.00 22.05 38.17 43.95 51.70 62.86 66.92 87.66 100.07 117.52 142.25 159.38 197.84 225.00 248.48 278.75 291.18 323.06 330.74 343.14 369.30 379.87 402.60 421.06 428.61 434.45 476.14 507.05 518.78 532.52 555.67 565.78 606.03 617.09 656.86 659.16 671.41 712.94 740.88 751.54 769.65 801.19 812.43 851.81 865.95 874.05 883.63 891.40 959.00 961.77 974.08 987.84 1014.29 1018.79 1041.05 1043.55 1109.58 1137.41 1138.94 1155.05 1172.75 1196.53 1206.89 1221.61 1232.19 1243.63 1252.28 1290.81 1328.68 1333.51 1347.02 1355.06 1366.24 1373.55 1382.27 1391.14 1419.67 1439.97 1466.43 1476.61 1484.27 1497.00 1501.50 1507.97 1510.99 1540.54 1582.43 1600.06 1674.49 1682.29 1702.86 1772.84 1802.28 1824.71 3065.17 3100.39 3118.09 3131.06 3152.43 3174.19 3179.67 3192.12 3197.56 3203.20 3231.51 3306.42 3373.32 3557.80 3603.59 3649.46 3790.12 3878.27
frequency: 22.05 38.17 43.95 51.70 62.86 66.92 87.66 100.07 117.52 142.25 159.38 197.84 225.00 248.48 278.75 291.18 323.06 330.74 343.14 369.30 379.87 402.60 421.06 428.61 434.45 476.14 507.05 518.78 532.52 555.67 565.78 606.03 617.09 656.86 659.16 671.41 712.94 740.88 751.54 769.65 801.19 812.43 851.81 865.95 874.05 883.63 891.40 959.00 961.77 974.08 987.84 1014.29 1018.79 1041.05 1043.55 1109.58 1137.41 1138.94 1155.05 1172.75 1196.53 1206.89 1221.61 1232.19 1243.63 1252.28 1290.81 1328.68 1333.51 1347.02 1355.06 1366.24 1373.55 1382.27 1391.14 1419.67 1439.97 1466.43 1476.61 1484.27 1497.00 1501.50 1507.97 1510.99 1540.54 1582.43 1600.06 1674.49 1682.29 1702.86 1772.84 1802.28 1824.71 3065.17 3100.39 3118.09 3131.06 3152.43 3174.19 3179.67 3192.12 3197.56 3203.20 3231.51 3306.42 3373.32 3557.80 3603.59 3649.46 3790.12 3878.27
formula: C13H18N3O5
InChI: InChI=1S/C13H18N3O5/c14-10(5-8-1-3-9(17)4-2-8)13(21)16-6-11(18)15-7-12(19)20/h1-4,10,15-17,19H,5-7H2,14H3
39 atoms
N  -2.871251 0.310786 -0.934716
H  -3.709144 0.809732 -1.189736
C  -1.873546 0.083979 -1.944102
C  -0.749648 1.108676 -2.001092
H  -1.413724 -0.899284 -1.850705
H  -2.356672 0.102309 -2.924098
O  0.397172 0.817844 -2.276831
C  -2.744442 0.084055 0.408802
C  -1.437848 -0.540895 0.906733
O  -3.608804 0.392753 1.195208
N  -0.44277 0.518601 1.021714
H  -1.076433 -1.326431 0.249399
H  -1.641116 -0.982069 1.881468
H  -0.735482 1.351539 1.515828
C  0.857116 0.511867 0.703818
C  1.496683 -0.734235 0.071969
O  1.59471 1.472891 0.886231
H  0.811119 -1.308145 -0.545459
O  -1.151587 2.343275 -1.752839
H  -0.399151 2.947373 -1.828459
N  2.536817 -0.149955 -0.836632
H  3.277658 -0.808754 -1.063676
H  2.074635 0.197128 -1.687379
H  2.904857 0.670409 -0.327704
C  2.162339 -1.616744 1.135369
H  2.887889 -1.010926 1.684811
H  2.708477 -2.418203 0.628787
C  1.141028 -2.198177 2.080702
C  0.827937 -1.549531 3.274836
C  0.453546 -3.362674 1.755882
C  -0.154033 -2.038917 4.11742
H  1.362751 -0.647535 3.554953
C  -0.533921 -3.867575 2.589893
H  0.694801 -3.899371 0.842965
C  -0.842151 -3.203603 3.775949
H  -0.39426 -1.542884 5.049286
H  -1.052921 -4.783499 2.328094
O  -1.788122 -3.637497 4.63943
H  -2.180835 -4.457882 4.330432
totalener: -1047.13104391 hartree
nucrepener: 1815.64209699 hartree
electener: -2862.77314090 hartree
oneelecener: -5014.18619513 hartree
twoeener: 2151.41305423 hartree
kineticenergy: 1042.89712807 hartree
exchangeener: -91.750128281427 hartree
correlationener: -6.628160255607 hartree
xcener: -98.378288537034 hartree
temp: 298.15 k
press: 1.00 atm
thermalcorrenthalpy: 0.00094421 hartree
totalenthalpy: -1046.87328293 hartree
totalentropycorr: -0.06735376 hartree
gibbsenthalpy: -1046.94063669 hartree
gibbsminuselec: 0.27845646 hartree
chargesum: 1.0000000
charge: -0.185882 0.203745 -0.095849 0.356007 0.119682 0.150371 -0.404574 0.169781 -0.090316 -0.286469 -0.129758 0.109254 0.149497 0.210985 0.133716 0.013244 -0.353220 0.138537 -0.224556 0.243930 -0.057805 0.225093 0.248837 0.232414 -0.176887 0.141242 0.117841 0.044324 -0.172681 -0.231733 -0.125113 0.138814 -0.117439 0.126737 0.170151 0.144169 0.115054 -0.267670 0.216528
charge: 0.324268 -0.006290 -0.053598 -0.424716 0.029388 0.050436 0.094017 -0.391536 -0.025131 0.123178 0.358221 0.016595 0.041372 0.011008 -0.396644 -0.048740 0.092767 0.025968 0.409795 -0.068704 0.614227 0.042158 0.014012 0.034563 -0.001608 0.043085 0.034580 -0.109730 0.002627 -0.008469 0.006463 0.029778 -0.017372 0.024260 -0.195038 0.032396 0.021544 0.373199 -0.102329
qa: -0.1859 0.2037 -0.0958 0.3560 0.1197 0.1504 -0.4046 0.1698 -0.0903 -0.2865 -0.1298 0.1093 0.1495 0.2110 0.1337 0.0132 -0.3532 0.1385 -0.2246 0.2439 -0.0578 0.2251 0.2488 0.2324 -0.1769 0.1412 0.1178 0.0443 -0.1727 -0.2317 -0.1251 0.1388 -0.1174 0.1267 0.1702 0.1442 0.1151 -0.2677 0.2165
va: 3.0931 1.0080 3.8874 4.1849 1.0078 0.9965 2.0706 4.3948 3.7636 2.2307 3.0966 0.9991 1.0287 1.0038 4.3434 3.8638 2.1760 1.0136 2.2956 1.0153 3.6082 0.9777 1.0116 1.0194 3.8793 1.0104 1.0067 3.5621 3.9964 4.0184 3.9515 1.0038 3.9104 1.0047 4.1043 1.0096 1.0065 2.2328 1.0261
dispcorr: -0.088052759 hartree
energy: -1047.219094310642
dipole: 7.24231 -4.86715 2.37516 -5.72546 5.15784 -0.56762 -4.06867 0.96888 -3.09979
magnitude: 3.94617 au
magnitude: 10.03038 debye
zeropoint: 0.32467395 hartree
thermalvibcorrection: 0.01736197 hartree
thermalrotcorrection: 0.00141627 hartree
thermaltrasncorrection: 0.00141627 hartree
thermaltotal: -1046.87422585 hartree
thermalcorr: 0.02019451 hartree
nonthermalcorr: 0.32467395 hartree
totalcorr: 0.34486846 hartree
totalenthalpy: -1046.87328164 hartree
