program: Orca
programVersion: 5.0.2
elementType: N H C C H H O C C O N H H H C C O H O H N H H H C H H C C C C H C H C H H O H
charge: 1
multiplicity: 1
keywords: wB97X-D3BJ Opt Freq def2-TZVPP def2/J RIJCOSX VeryTightSCF
keywords: PAL8 defgrid3 VeryTightOpt
frequency: 0.00 0.00 0.00 0.00 0.00 0.00 25.07 41.62 47.76 62.12 68.10 88.18 101.51 106.59 117.88 150.90 170.36 226.24 242.91 251.71 261.61 306.35 312.82 323.77 332.30 362.04 381.44 403.35 428.10 434.50 436.06 459.08 510.57 527.70 560.19 565.37 579.74 617.96 653.36 658.70 659.68 705.85 720.48 744.48 751.98 768.98 800.61 804.97 828.69 855.63 871.43 883.05 899.16 961.64 969.28 989.58 996.18 1011.30 1019.02 1042.44 1047.74 1110.54 1139.63 1144.93 1161.52 1167.58 1196.60 1207.15 1227.23 1232.98 1250.48 1259.30 1288.77 1329.37 1334.17 1344.58 1359.97 1363.03 1370.78 1382.50 1393.23 1401.20 1405.78 1468.75 1482.61 1485.98 1494.06 1496.72 1499.81 1502.48 1538.27 1582.52 1608.89 1674.41 1682.08 1702.79 1780.14 1826.97 1845.16 3066.40 3103.08 3121.39 3127.92 3158.25 3171.61 3180.78 3186.17 3188.75 3205.06 3231.26 3301.28 3346.89 3554.28 3612.10 3626.31 3731.40 3877.30
frequency: 25.07 41.62 47.76 62.12 68.10 88.18 101.51 106.59 117.88 150.90 170.36 226.24 242.91 251.71 261.61 306.35 312.82 323.77 332.30 362.04 381.44 403.35 428.10 434.50 436.06 459.08 510.57 527.70 560.19 565.37 579.74 617.96 653.36 658.70 659.68 705.85 720.48 744.48 751.98 768.98 800.61 804.97 828.69 855.63 871.43 883.05 899.16 961.64 969.28 989.58 996.18 1011.30 1019.02 1042.44 1047.74 1110.54 1139.63 1144.93 1161.52 1167.58 1196.60 1207.15 1227.23 1232.98 1250.48 1259.30 1288.77 1329.37 1334.17 1344.58 1359.97 1363.03 1370.78 1382.50 1393.23 1401.20 1405.78 1468.75 1482.61 1485.98 1494.06 1496.72 1499.81 1502.48 1538.27 1582.52 1608.89 1674.41 1682.08 1702.79 1780.14 1826.97 1845.16 3066.40 3103.08 3121.39 3127.92 3158.25 3171.61 3180.78 3186.17 3188.75 3205.06 3231.26 3301.28 3346.89 3554.28 3612.10 3626.31 3731.40 3877.30
formula: C13H18N3O5
InChI: InChI=1S/C13H18N3O5/c14-10(5-8-1-3-9(17)4-2-8)13(21)16-6-11(18)15-7-12(19)20/h1-4,10,15-17,19H,5-7H2,14H3
39 atoms
N  -1.899968 -0.900856 -2.261555
H  -2.773026 -0.789789 -2.756361
C  -0.71673 -0.367868 -2.907999
C  0.46218 -1.32613 -2.873418
H  -0.953246 -0.205148 -3.962247
H  -0.375526 0.584212 -2.504227
O  1.608217 -0.943905 -2.905785
C  -2.111378 -1.076658 -0.901239
C  -0.912379 -1.18004 0.048488
O  -3.226841 -1.241699 -0.474732
N  -0.018402 -0.036033 -0.000276
H  -0.363419 -2.090031 -0.184778
H  -1.331668 -1.305711 1.045904
H  -0.429898 0.8749 0.150029
C  1.326388 -0.010587 0.016754
C  2.135793 -1.317696 0.00781
O  1.965877 1.029791 0.047487
H  1.640305 -2.144727 -0.493816
O  0.176445 -2.621092 -2.785691
H  -0.786807 -2.733602 -2.760111
N  3.344298 -0.964567 -0.806345
H  4.139445 -1.566692 -0.606401
H  3.088567 -1.014365 -1.80441
H  3.557075 0.018248 -0.575707
C  2.545257 -1.70902 1.433522
H  3.072278 -0.867944 1.890948
H  3.24058 -2.551909 1.375434
C  1.33659 -2.087814 2.252428
C  0.714603 -1.15988 3.079683
C  0.783214 -3.364349 2.146784
C  -0.440555 -1.486444 3.77761
H  1.13453 -0.165061 3.188993
C  -0.367165 -3.70569 2.833923
H  1.26462 -4.112604 1.52362
C  -0.987206 -2.762294 3.65445
H  -0.908431 -0.754407 4.427356
H  -0.793372 -4.698328 2.762785
O  -2.10722 -3.151378 4.304552
H  -2.43957 -2.44408 4.863269
totalener: -1047.12079715 hartree
nucrepener: 1823.73140652 hartree
electener: -2870.85220367 hartree
oneelecener: -5030.05063232 hartree
twoeener: 2159.19842865 hartree
kineticenergy: 1041.98510397 hartree
exchangeener: -91.585107337950 hartree
correlationener: -6.619601341262 hartree
xcener: -98.204708679212 hartree
temp: 298.15 k
press: 1.00 atm
thermalcorrenthalpy: 0.00094421 hartree
totalenthalpy: -1046.86788155 hartree
totalentropycorr: -0.06287020 hartree
gibbsenthalpy: -1046.93075175 hartree
gibbsminuselec: 0.27909741 hartree
totalenthalpy: -1046.87006872 hartree
chargesum: 1.0000000
charge: -0.267878 0.208072 -0.091053 0.328899 0.156186 0.139457 -0.368539 0.160172 -0.081870 -0.260022 -0.183415 0.116645 0.155426 0.205127 0.199669 -0.031651 -0.344689 0.146231 -0.217136 0.241641 -0.039720 0.224229 0.244994 0.231940 -0.172970 0.141660 0.120124 0.043151 -0.195699 -0.213650 -0.129413 0.139614 -0.118252 0.129220 0.174706 0.116078 0.143389 -0.268283 0.217616
charge: 0.296247 -0.009801 -0.052007 -0.431298 0.049725 0.031963 0.129847 -0.382116 -0.032327 0.141947 0.348462 0.025209 0.043249 0.003175 -0.391225 -0.049320 0.103905 0.028345 0.398943 -0.091759 0.616008 0.042811 0.009050 0.036976 -0.000490 0.042705 0.035268 -0.109651 -0.000266 -0.006149 -0.017884 0.029009 0.005813 0.025805 -0.195233 0.022426 0.031355 0.372945 -0.101663
qa: -0.2679 0.2081 -0.0911 0.3289 0.1562 0.1395 -0.3685 0.1602 -0.0819 -0.2600 -0.1834 0.1166 0.1554 0.2051 0.1997 -0.0317 -0.3447 0.1462 -0.2171 0.2416 -0.0397 0.2242 0.2450 0.2319 -0.1730 0.1417 0.1201 0.0432 -0.1957 -0.2136 -0.1294 0.1396 -0.1183 0.1292 0.1747 0.1161 0.1434 -0.2683 0.2176
va: 3.0119 1.0017 3.8480 4.1898 0.9917 1.0070 2.1307 4.3699 3.6829 2.2524 3.0775 1.0185 1.0338 1.0012 4.2977 3.9028 2.1805 1.0123 2.2550 1.0215 3.5943 0.9782 1.0232 1.0164 3.8716 1.0120 1.0061 3.5601 4.0046 3.9964 3.8879 1.0062 3.9698 1.0022 4.1015 1.0080 1.0085 2.2337 1.0254
dispcorr: -0.089194569 hartree
energy: -1047.215975262419
dipole: 6.48679 -4.45398 2.03282 -0.26352 0.62719 0.36367 0.34483 -1.81798 -1.47315
magnitude: 2.53669 au
magnitude: 6.44775 debye
zeropoint: 0.32505192 hartree
thermalvibcorrection: 0.01707940 hartree
thermalrotcorrection: 0.00141627 hartree
thermaltrasncorrection: 0.00141627 hartree
thermaltotal: -1046.87101140 hartree
thermalcorr: 0.01991194 hartree
nonthermalcorr: 0.32505192 hartree
totalcorr: 0.34496386 hartree
totalenthalpy: -1046.87006719 hartree
