program: Orca
programVersion: 5.0.2
elementType: N H C C H H O C C O N H H H C C O H O H N H H H C H H C C C C H C H C H H O H
charge: 1
multiplicity: 1
keywords: wB97X-D3BJ Opt Freq def2-TZVPP def2/J RIJCOSX VeryTightSCF
keywords: PAL8 defgrid3 VeryTightOpt
frequency: 0.00 0.00 0.00 0.00 0.00 0.00 21.30 40.44 44.93 54.58 62.67 76.16 92.75 101.52 133.32 165.45 170.94 209.04 226.28 281.61 289.91 313.23 328.43 349.55 374.10 382.65 423.02 429.71 433.09 438.84 462.30 486.94 502.38 526.52 553.65 563.28 588.12 633.44 643.56 659.17 666.96 675.79 705.24 735.16 746.81 752.57 778.23 835.89 859.34 871.86 877.89 891.78 894.96 919.01 963.79 983.15 995.97 1019.66 1023.54 1042.77 1057.70 1124.89 1138.05 1144.07 1164.84 1176.29 1195.04 1201.42 1207.43 1231.86 1251.50 1264.97 1293.64 1310.57 1327.84 1338.04 1343.97 1366.31 1371.89 1388.83 1410.90 1442.90 1455.81 1468.76 1490.26 1495.07 1497.13 1508.88 1526.99 1542.19 1578.31 1580.17 1669.90 1677.46 1690.68 1701.67 1747.11 1792.87 1853.01 2470.74 3085.57 3098.93 3124.75 3151.68 3153.37 3166.35 3169.23 3182.16 3201.05 3202.49 3227.62 3426.63 3548.08 3617.81 3630.64 3791.11 3876.59
frequency: 21.30 40.44 44.93 54.58 62.67 76.16 92.75 101.52 133.32 165.45 170.94 209.04 226.28 281.61 289.91 313.23 328.43 349.55 374.10 382.65 423.02 429.71 433.09 438.84 462.30 486.94 502.38 526.52 553.65 563.28 588.12 633.44 643.56 659.17 666.96 675.79 705.24 735.16 746.81 752.57 778.23 835.89 859.34 871.86 877.89 891.78 894.96 919.01 963.79 983.15 995.97 1019.66 1023.54 1042.77 1057.70 1124.89 1138.05 1144.07 1164.84 1176.29 1195.04 1201.42 1207.43 1231.86 1251.50 1264.97 1293.64 1310.57 1327.84 1338.04 1343.97 1366.31 1371.89 1388.83 1410.90 1442.90 1455.81 1468.76 1490.26 1495.07 1497.13 1508.88 1526.99 1542.19 1578.31 1580.17 1669.90 1677.46 1690.68 1701.67 1747.11 1792.87 1853.01 2470.74 3085.57 3098.93 3124.75 3151.68 3153.37 3166.35 3169.23 3182.16 3201.05 3202.49 3227.62 3426.63 3548.08 3617.81 3630.64 3791.11 3876.59
formula: C13H18N3O5
InChI: InChI=1S/C13H18N3O5/c14-10(5-8-1-3-9(17)4-2-8)13(21)16-6-11(18)15-7-12(19)20/h1-4,10,15-17,19H,5-7H2,14H3
39 atoms
N  -2.499215 -1.289642 2.015266
H  -2.579961 -1.557734 2.985188
C  -3.63582 -0.627847 1.410658
C  -3.417454 0.865367 1.203283
H  -3.892264 -1.066236 0.443103
H  -4.502608 -0.777024 2.051898
O  -2.337602 1.392874 1.151622
C  -1.272027 -1.446652 1.509209
C  -0.96029 -1.028371 0.074973
O  -0.369451 -1.942111 2.196837
N  0.032888 0.020267 0.060347
H  -1.839009 -0.671438 -0.455125
H  -0.618364 -1.90355 -0.478604
H  -0.331063 0.955679 0.177315
C  1.383644 -0.008095 -0.088415
C  2.218789 -1.300157 -0.103218
O  2.020448 1.013067 -0.23186
H  3.120986 -1.016841 0.43595
O  -4.578842 1.494733 1.04352
H  -4.40687 2.432269 0.875813
N  1.637599 -2.478861 0.626367
H  1.185569 -3.105251 -0.044483
H  2.377516 -3.004455 1.086019
H  0.890494 -2.21703 1.3608
C  2.581601 -1.70659 -1.542645
H  3.333953 -2.498895 -1.506014
H  3.04821 -0.837644 -2.006441
C  1.365987 -2.155743 -2.312494
C  0.995343 -3.497431 -2.36073
C  0.534153 -1.219432 -2.934545
C  -0.186399 -3.901949 -2.975428
H  1.654575 -4.258095 -1.949126
C  -0.638628 -1.60548 -3.554356
H  0.816216 -0.172059 -2.936832
C  -1.010485 -2.951928 -3.568949
H  -0.448575 -4.953937 -3.013152
H  -1.274117 -0.883311 -4.051929
O  -2.176685 -3.263729 -4.183817
H  -2.295466 -4.216253 -4.222882
totalener: -1047.12941936 hartree
nucrepener: 1778.70443273 hartree
electener: -2825.83385209 hartree
oneelecener: -4940.93961448 hartree
twoeener: 2115.10576239 hartree
kineticenergy: 1041.97973630 hartree
exchangeener: -91.589754119062 hartree
correlationener: -6.618101765563 hartree
xcener: -98.207855884625 hartree
temp: 298.15 k
press: 1.00 atm
thermalcorrenthalpy: 0.00094421 hartree
totalenthalpy: -1046.87477522 hartree
totalentropycorr: -0.06306406 hartree
gibbsenthalpy: -1046.93783928 hartree
gibbsminuselec: 0.27802818 hartree
totalenthalpy: -1046.87630793 hartree
chargesum: 1.0000000
charge: -0.148523 0.204290 -0.122039 0.326692 0.141324 0.153654 -0.327791 0.295868 -0.146580 -0.381869 -0.154642 0.140502 0.109251 0.212506 0.131956 0.033846 -0.295369 0.163318 -0.244444 0.251229 -0.087539 0.191368 0.222058 0.221521 -0.206435 0.129947 0.151845 0.031220 -0.275414 -0.164152 -0.112362 0.155111 -0.139458 0.153835 0.172886 0.119842 0.147658 -0.273915 0.218805
charge: 0.355036 0.005071 -0.037648 -0.439414 0.038615 0.045765 0.122254 -0.334403 -0.049213 0.145866 0.334951 0.032097 0.031767 -0.005664 -0.392852 -0.045336 0.121898 0.047299 0.391038 -0.070508 0.588777 0.021674 0.038218 -0.069983 0.005523 0.035894 0.052219 -0.113065 -0.029935 0.010394 -0.021381 0.022627 0.006723 0.035301 -0.197425 0.022010 0.031975 0.366598 -0.102762
qa: -0.1485 0.2043 -0.1220 0.3267 0.1413 0.1537 -0.3278 0.2959 -0.1466 -0.3819 -0.1546 0.1405 0.1093 0.2125 0.1320 0.0338 -0.2954 0.1633 -0.2444 0.2512 -0.0875 0.1914 0.2221 0.2215 -0.2064 0.1299 0.1518 0.0312 -0.2754 -0.1642 -0.1124 0.1551 -0.1395 0.1538 0.1729 0.1198 0.1477 -0.2739 0.2188
va: 3.2302 1.0034 3.8447 4.2450 0.9977 1.0056 2.1429 4.2153 3.9074 2.1419 3.0187 1.0096 1.0282 1.0187 4.3918 3.7819 2.2345 1.0129 2.2603 1.0079 3.5318 1.0348 0.9798 1.1140 3.8788 1.0022 1.0148 3.5316 4.0082 3.9784 3.9384 1.0022 3.9228 1.0017 4.0981 1.0070 1.0080 2.2242 1.0243
dispcorr: -0.087028355 hartree
energy: -1047.221490892955
dipole: 3.70594 -4.36559 -0.65965 -7.86300 5.58325 -2.27975 -1.54556 2.59578 1.05022
magnitude: 2.59525 au
magnitude: 6.59661 debye
zeropoint: 0.32454156 hartree
thermalvibcorrection: 0.01686485 hartree
thermalrotcorrection: 0.00141627 hartree
thermaltrasncorrection: 0.00141627 hartree
thermaltotal: -1046.87725194 hartree
thermalcorr: 0.01969739 hartree
nonthermalcorr: 0.32454156 hartree
totalcorr: 0.34423895 hartree
totalenthalpy: -1046.87630773 hartree
