program: Orca
programVersion: 5.0.2
elementType: N H C C H H O C C O N H H H C C O H O H N H H H C H H C C C C H C H C H H O H
charge: 1
multiplicity: 1
keywords: wB97X-D3BJ Opt Freq def2-TZVPP def2/J RIJCOSX VeryTightSCF
keywords: PAL8 defgrid3 VeryTightOpt
frequency: 0.00 0.00 0.00 0.00 0.00 0.00 24.91 29.95 42.26 54.42 62.23 66.97 76.02 102.33 115.45 154.62 171.67 186.18 222.60 293.17 297.24 301.98 316.74 345.85 362.29 372.67 379.82 409.00 426.86 430.12 444.23 492.03 499.26 527.24 531.65 550.31 559.83 605.52 640.59 659.71 665.91 695.23 730.34 742.43 768.14 774.52 820.36 829.38 857.07 873.33 877.32 887.86 889.82 908.19 961.53 982.53 983.69 1010.21 1018.68 1041.92 1074.53 1101.17 1144.46 1157.95 1159.58 1185.52 1200.66 1201.11 1207.67 1249.10 1270.19 1274.76 1291.40 1317.25 1331.54 1336.31 1346.87 1362.29 1371.66 1392.87 1419.28 1443.76 1453.63 1469.50 1473.59 1489.77 1495.47 1498.42 1517.15 1520.89 1531.52 1580.31 1619.84 1673.87 1687.38 1701.84 1745.25 1784.93 1848.66 3096.93 3099.14 3125.63 3152.70 3165.25 3168.34 3177.66 3185.56 3204.30 3207.66 3230.81 3252.45 3456.28 3517.75 3584.62 3634.19 3792.72 3877.96
frequency: 24.91 29.95 42.26 54.42 62.23 66.97 76.02 102.33 115.45 154.62 171.67 186.18 222.60 293.17 297.24 301.98 316.74 345.85 362.29 372.67 379.82 409.00 426.86 430.12 444.23 492.03 499.26 527.24 531.65 550.31 559.83 605.52 640.59 659.71 665.91 695.23 730.34 742.43 768.14 774.52 820.36 829.38 857.07 873.33 877.32 887.86 889.82 908.19 961.53 982.53 983.69 1010.21 1018.68 1041.92 1074.53 1101.17 1144.46 1157.95 1159.58 1185.52 1200.66 1201.11 1207.67 1249.10 1270.19 1274.76 1291.40 1317.25 1331.54 1336.31 1346.87 1362.29 1371.66 1392.87 1419.28 1443.76 1453.63 1469.50 1473.59 1489.77 1495.47 1498.42 1517.15 1520.89 1531.52 1580.31 1619.84 1673.87 1687.38 1701.84 1745.25 1784.93 1848.66 3096.93 3099.14 3125.63 3152.70 3165.25 3168.34 3177.66 3185.56 3204.30 3207.66 3230.81 3252.45 3456.28 3517.75 3584.62 3634.19 3792.72 3877.96
formula: C13H18N3O5
InChI: InChI=1S/C13H18N3O5/c14-10(5-8-1-3-9(17)4-2-8)13(21)16-6-11(18)15-7-12(19)20/h1-4,10,15-17,19H,5-7H2,14H3
39 atoms
N  -2.510224 -1.312178 1.656785
H  -2.616203 -1.700879 2.582021
C  -3.612152 -0.531812 1.137832
C  -3.353063 0.968625 1.20744
H  -3.839298 -0.786609 0.099797
H  -4.506933 -0.768356 1.710876
O  -2.260587 1.463656 1.305787
C  -1.246089 -1.331989 1.204049
C  -0.922244 -0.742151 -0.169299
O  -0.347004 -1.853166 1.86464
N  0.179057 0.195802 -0.069517
H  -1.759975 -0.212268 -0.609827
H  -0.682957 -1.567704 -0.835573
H  -0.115563 1.119567 0.224554
C  1.419513 -0.082438 0.407705
C  2.132702 -1.433432 0.186455
O  2.079759 0.740427 1.01377
H  3.107818 -1.145285 -0.208735
O  -4.489933 1.652942 1.101948
H  -4.28756 2.599172 1.111758
N  2.379924 -1.918561 1.586735
H  2.937573 -2.774619 1.574615
H  2.849134 -1.181612 2.115842
H  1.446375 -2.093144 1.998759
C  1.595491 -2.591666 -0.652191
H  1.389802 -2.21518 -1.656237
H  0.667873 -2.973318 -0.229077
C  2.615179 -3.708399 -0.692083
C  3.751418 -3.618884 -1.4934
C  2.465865 -4.83326 0.120668
C  4.712166 -4.617624 -1.486379
H  3.888229 -2.763102 -2.147316
C  3.420421 -5.837983 0.143351
H  1.574607 -4.941292 0.732826
C  4.550834 -5.732124 -0.663473
H  5.584996 -4.536064 -2.125512
H  3.299237 -6.715572 0.765666
O  5.449888 -6.741843 -0.607686
H  6.175332 -6.583716 -1.217195
totalener: -1047.13362180 hartree
nucrepener: 1682.27897315 hartree
electener: -2729.41259495 hartree
oneelecener: -4748.56226214 hartree
twoeener: 2019.14966719 hartree
kineticenergy: 1041.97442726 hartree
exchangeener: -91.589308433706 hartree
correlationener: -6.613768900310 hartree
xcener: -98.203077334016 hartree
temp: 298.15 k
press: 1.00 atm
thermalcorrenthalpy: 0.00094421 hartree
totalenthalpy: -1046.87434924 hartree
totalentropycorr: -0.06393777 hartree
gibbsenthalpy: -1046.93828701 hartree
gibbsminuselec: 0.27757751 hartree
totalenthalpy: -1046.87664330 hartree
totalenthalpy: -1046.87732631 hartree
chargesum: 1.0000000
charge: -0.161752 0.197698 -0.112157 0.318061 0.139192 0.150474 -0.325660 0.312140 -0.109256 -0.462695 -0.171628 0.136866 0.132233 0.205726 0.184170 -0.029241 -0.327396 0.178607 -0.245441 0.249863 -0.059300 0.231073 0.236892 0.245779 -0.170357 0.138779 0.118554 0.017341 -0.183202 -0.246651 -0.145454 0.136457 -0.125760 0.144640 0.196936 0.115036 0.143468 -0.271400 0.217366
charge: 0.347305 0.000455 -0.041221 -0.440447 0.038314 0.044980 0.118697 -0.352206 -0.037857 0.079020 0.327215 0.029580 0.029331 0.000503 -0.385113 -0.045123 0.106443 0.050599 0.389516 -0.071843 0.617612 0.040831 0.049276 0.001706 -0.011590 0.042080 0.028877 -0.113420 -0.001199 -0.021222 -0.007873 0.028009 0.004835 0.023592 -0.190673 0.023148 0.030770 0.369570 -0.102474
qa: -0.1618 0.1977 -0.1122 0.3181 0.1392 0.1505 -0.3257 0.3121 -0.1093 -0.4627 -0.1716 0.1369 0.1322 0.2057 0.1842 -0.0292 -0.3274 0.1786 -0.2454 0.2499 -0.0593 0.2311 0.2369 0.2458 -0.1704 0.1388 0.1186 0.0173 -0.1832 -0.2467 -0.1455 0.1365 -0.1258 0.1446 0.1969 0.1150 0.1435 -0.2714 0.2174
va: 3.2155 1.0080 3.8509 4.2555 0.9976 1.0067 2.1502 4.1481 3.9550 2.0290 3.1286 1.0058 0.9957 1.0168 4.3770 3.8069 2.1828 1.0091 2.2588 1.0089 3.5897 0.9884 0.9916 1.0267 3.7888 1.0000 1.0139 3.5396 4.0527 3.9730 3.9563 1.0045 4.0007 1.0024 4.0886 1.0071 1.0084 2.2291 1.0257
dispcorr: -0.084138648 hartree
energy: -1047.223956833012
dipole: 0.81239 -1.81988 -1.00749 -4.39208 4.36835 -0.02372 -2.81143 2.82389 0.01247
magnitude: 1.00785 au
magnitude: 2.56175 debye
zeropoint: 0.32563242 hartree
thermalvibcorrection: 0.01716232 hartree
thermalrotcorrection: 0.00141627 hartree
thermaltrasncorrection: 0.00141627 hartree
thermaltotal: -1046.87832955 hartree
thermalcorr: 0.01999486 hartree
nonthermalcorr: 0.32563242 hartree
totalcorr: 0.34562728 hartree
totalenthalpy: -1046.87738534 hartree
