program: Orca
programVersion: 5.0.2
elementType: N H C C H H O C C O N H H H C C O H O H N H H H C H H C C C C H C H C H H O H
charge: 1
multiplicity: 1
keywords: wB97X-D3BJ Opt Freq def2-TZVPP def2/J RIJCOSX VeryTightSCF
keywords: PAL8 defgrid3 VeryTightOpt
frequency: 0.00 0.00 0.00 0.00 0.00 0.00 26.70 27.20 39.46 45.10 57.16 77.97 87.87 93.07 126.41 149.75 204.95 228.47 248.32 264.94 278.15 309.54 315.80 329.23 355.23 368.85 377.43 385.82 427.86 429.48 439.91 481.35 514.40 527.10 535.75 541.22 589.25 594.58 615.50 656.88 662.06 679.24 701.70 713.58 732.02 753.60 789.22 794.83 844.54 865.02 867.59 879.84 885.30 953.71 970.81 987.28 997.65 1014.95 1019.15 1043.27 1048.88 1124.77 1150.64 1162.68 1166.93 1190.98 1195.46 1214.44 1218.71 1241.98 1263.18 1283.56 1302.11 1321.60 1329.51 1333.24 1356.55 1372.82 1379.04 1397.91 1425.44 1447.91 1449.62 1461.52 1489.85 1498.07 1500.73 1503.91 1522.14 1529.76 1537.65 1585.73 1627.15 1676.30 1688.84 1706.79 1745.17 1784.99 1849.13 3042.61 3047.00 3109.79 3115.12 3119.82 3146.24 3161.25 3164.40 3192.64 3208.84 3210.58 3229.40 3477.30 3555.94 3629.39 3633.25 3799.68 3879.58
frequency: 26.70 27.20 39.46 45.10 57.16 77.97 87.87 93.07 126.41 149.75 204.95 228.47 248.32 264.94 278.15 309.54 315.80 329.23 355.23 368.85 377.43 385.82 427.86 429.48 439.91 481.35 514.40 527.10 535.75 541.22 589.25 594.58 615.50 656.88 662.06 679.24 701.70 713.58 732.02 753.60 789.22 794.83 844.54 865.02 867.59 879.84 885.30 953.71 970.81 987.28 997.65 1014.95 1019.15 1043.27 1048.88 1124.77 1150.64 1162.68 1166.93 1190.98 1195.46 1214.44 1218.71 1241.98 1263.18 1283.56 1302.11 1321.60 1329.51 1333.24 1356.55 1372.82 1379.04 1397.91 1425.44 1447.91 1449.62 1461.52 1489.85 1498.07 1500.73 1503.91 1522.14 1529.76 1537.65 1585.73 1627.15 1676.30 1688.84 1706.79 1745.17 1784.99 1849.13 3042.61 3047.00 3109.79 3115.12 3119.82 3146.24 3161.25 3164.40 3192.64 3208.84 3210.58 3229.40 3477.30 3555.94 3629.39 3633.25 3799.68 3879.58
formula: C13H18N3O5
InChI: InChI=1S/C13H18N3O5/c14-10(5-8-1-3-9(17)4-2-8)13(21)16-6-11(18)15-7-12(19)20/h1-4,10,15-17,19H,5-7H2,14H3
39 atoms
N  -1.731417 -2.017974 2.580152
H  -1.502297 -2.325091 3.513838
C  -2.918656 -2.572612 1.974777
C  -2.615008 -3.829666 1.169424
H  -3.637231 -2.816074 2.756593
H  -3.41545 -1.854975 1.319313
O  -1.504683 -4.209342 0.904537
C  -0.704501 -1.442862 1.933363
C  -0.907865 -1.042687 0.471551
O  0.36218 -1.235062 2.512924
N  -0.004529 -0.000463 0.046923
H  -1.919061 -0.665161 0.325656
H  -0.817873 -1.931999 -0.153516
H  -0.365583 0.941804 0.071016
C  1.347325 -0.002792 -0.009269
C  2.197658 -1.291611 0.022457
O  1.988063 1.030817 -0.060584
H  3.018262 -1.067329 -0.657537
O  -3.73957 -4.431405 0.786656
H  -3.515497 -5.216022 0.26743
N  2.786294 -1.267076 1.408715
H  3.430109 -2.039486 1.566506
H  3.274654 -0.380636 1.547657
H  1.974886 -1.311334 2.068719
C  1.643422 -2.672486 -0.287253
H  0.954703 -3.009028 0.490078
H  2.490966 -3.368207 -0.256364
C  0.976957 -2.765256 -1.645246
C  0.154373 -3.862491 -1.913544
C  1.163981 -1.822622 -2.650145
C  -0.463463 -4.013442 -3.140139
H  -0.008231 -4.607895 -1.143653
C  0.545661 -1.959886 -3.887237
H  1.796597 -0.954659 -2.501335
C  -0.270058 -3.057246 -4.137088
H  -1.0943 -4.868164 -3.350031
H  0.704831 -1.211527 -4.656293
O  -0.904309 -3.254469 -5.318604
H  -0.679492 -2.557893 -5.940461
totalener: -1047.12917651 hartree
nucrepener: 1787.41409834 hartree
electener: -2834.54327485 hartree
oneelecener: -4958.95589195 hartree
twoeener: 2124.41261710 hartree
kineticenergy: 1041.99620524 hartree
exchangeener: -91.595269365179 hartree
correlationener: -6.617573380705 hartree
xcener: -98.212842745884 hartree
temp: 298.15 k
press: 1.00 atm
thermalcorrenthalpy: 0.00094421 hartree
totalenthalpy: -1046.87315813 hartree
totalentropycorr: -0.06326668 hartree
gibbsenthalpy: -1046.93642481 hartree
gibbsminuselec: 0.27898554 hartree
totalenthalpy: -1046.87467737 hartree
chargesum: 1.0000000
charge: -0.151511 0.197026 -0.091460 0.304243 0.158388 0.126661 -0.330696 0.282669 -0.091177 -0.426643 -0.146187 0.153225 0.120391 0.189069 0.121453 -0.029309 -0.309407 0.178228 -0.244355 0.246790 -0.045663 0.220321 0.239005 0.239233 -0.135182 0.109259 0.122819 -0.029523 -0.171118 -0.139938 -0.138149 0.127172 -0.147299 0.111467 0.200196 0.133171 0.108945 -0.278187 0.216074
charge: 0.350315 0.001922 -0.039536 -0.441057 0.046329 0.037427 0.116203 -0.352207 -0.036401 0.108808 0.342268 0.036260 0.035932 0.000151 -0.395227 -0.050704 0.103406 0.047891 0.389597 -0.074194 0.611638 0.041943 0.053114 -0.030456 -0.012693 0.031511 0.036726 -0.103335 -0.002282 -0.006140 0.002442 0.025781 -0.015604 0.024288 -0.192288 0.027970 0.020832 0.364042 -0.104674
qa: -0.1515 0.1970 -0.0915 0.3042 0.1584 0.1267 -0.3307 0.2827 -0.0912 -0.4266 -0.1462 0.1532 0.1204 0.1891 0.1215 -0.0293 -0.3094 0.1782 -0.2444 0.2468 -0.0457 0.2203 0.2390 0.2392 -0.1352 0.1093 0.1228 -0.0295 -0.1711 -0.1399 -0.1381 0.1272 -0.1473 0.1115 0.2002 0.1332 0.1089 -0.2782 0.2161
va: 3.2364 1.0107 3.8396 4.2706 1.0030 1.0084 2.1439 4.1728 3.8453 2.0771 3.1351 0.9933 1.0286 1.0152 4.4161 3.8213 2.2161 1.0013 2.2569 1.0115 3.5606 0.9806 0.9824 1.0579 3.8058 1.0101 0.9927 3.7122 4.0011 3.9777 3.9936 1.0259 3.9569 1.0175 4.0757 1.0105 1.0087 2.2203 1.0263
dispcorr: -0.086703898 hartree
energy: -1047.220757482387
dipole: 3.09297 -2.57992 0.51305 -0.14204 0.14613 0.00410 2.00273 0.00178 2.00451
magnitude: 2.06913 au
magnitude: 5.25932 debye
zeropoint: 0.32512773 hartree
thermalvibcorrection: 0.01717925 hartree
thermalrotcorrection: 0.00141627 hartree
thermaltrasncorrection: 0.00141627 hartree
thermaltotal: -1046.87561796 hartree
thermalcorr: 0.02001179 hartree
nonthermalcorr: 0.32512773 hartree
totalcorr: 0.34513952 hartree
totalenthalpy: -1046.87467375 hartree
