program: Orca
programVersion: 5.0.2
elementType: N H C C H H O C C O N H H H C C O H O H N H H H C H H C C C C H C H C H H O H
charge: 1
multiplicity: 1
keywords: wB97X-D3BJ Opt Freq def2-TZVPP def2/J RIJCOSX VeryTightSCF
keywords: PAL8 defgrid3 VeryTightOpt
frequency: 0.00 0.00 0.00 0.00 0.00 0.00 28.52 44.51 48.92 52.24 67.65 72.97 95.10 105.84 128.99 163.96 171.03 205.10 212.77 236.04 248.48 258.80 276.24 313.21 353.27 368.83 392.97 425.92 428.58 430.25 438.58 472.93 500.94 518.93 541.20 554.28 581.89 600.08 620.14 638.11 659.16 669.54 692.37 739.80 747.29 765.24 793.29 827.40 865.07 867.70 879.71 894.24 908.02 918.89 946.24 985.86 994.18 1019.09 1027.37 1043.20 1050.92 1064.98 1113.55 1142.96 1144.65 1194.50 1210.24 1211.29 1224.81 1233.61 1251.53 1281.19 1317.81 1325.56 1327.19 1338.35 1343.52 1372.85 1380.59 1393.51 1403.05 1416.52 1441.67 1450.35 1490.03 1494.14 1497.75 1501.28 1504.52 1519.75 1530.01 1580.33 1657.90 1673.81 1679.76 1702.52 1796.69 1806.54 1828.89 3074.99 3078.00 3122.51 3139.05 3141.82 3150.36 3176.63 3181.67 3195.09 3209.95 3226.97 3347.20 3493.90 3545.37 3569.10 3654.15 3789.60 3872.12
frequency: 28.52 44.51 48.92 52.24 67.65 72.97 95.10 105.84 128.99 163.96 171.03 205.10 212.77 236.04 248.48 258.80 276.24 313.21 353.27 368.83 392.97 425.92 428.58 430.25 438.58 472.93 500.94 518.93 541.20 554.28 581.89 600.08 620.14 638.11 659.16 669.54 692.37 739.80 747.29 765.24 793.29 827.40 865.07 867.70 879.71 894.24 908.02 918.89 946.24 985.86 994.18 1019.09 1027.37 1043.20 1050.92 1064.98 1113.55 1142.96 1144.65 1194.50 1210.24 1211.29 1224.81 1233.61 1251.53 1281.19 1317.81 1325.56 1327.19 1338.35 1343.52 1372.85 1380.59 1393.51 1403.05 1416.52 1441.67 1450.35 1490.03 1494.14 1497.75 1501.28 1504.52 1519.75 1530.01 1580.33 1657.90 1673.81 1679.76 1702.52 1796.69 1806.54 1828.89 3074.99 3078.00 3122.51 3139.05 3141.82 3150.36 3176.63 3181.67 3195.09 3209.95 3226.97 3347.20 3493.90 3545.37 3569.10 3654.15 3789.60 3872.12
formula: C13H18N3O5
InChI: InChI=1S/C13H18N3O5/c14-10(5-8-1-3-9(17)4-2-8)13(21)16-6-11(18)15-7-12(19)20/h1-4,10,15-17,19H,5-7H2,14H3
39 atoms
N  -3.161428 -1.713027 -0.744632
H  -4.120272 -1.426877 -0.863655
C  -2.775007 -3.021133 -1.251477
C  -2.210864 -3.943312 -0.173455
H  -3.664481 -3.490938 -1.666637
H  -2.029805 -2.941686 -2.042072
O  -1.025671 -4.101046 0.044967
C  -2.303358 -0.704258 -0.412237
C  -0.875975 -1.160267 -0.156894
O  -2.642229 0.447004 -0.264564
N  -0.009321 -0.035284 0.062275
H  -0.550015 -1.75013 -1.014646
H  -0.934968 -1.806134 0.72179
H  -0.465057 0.870146 0.094222
C  1.339948 -0.023138 -0.020283
C  2.170599 -1.326533 -0.102761
O  2.001318 0.990475 -0.042911
H  3.015116 -1.144776 0.561555
O  -3.162664 -4.557986 0.513611
H  -2.760068 -5.124442 1.187198
N  1.522987 -2.595056 0.42653
H  0.763188 -2.966539 -0.161495
H  2.232286 -3.325312 0.494169
H  1.136974 -2.458346 1.360036
C  2.675115 -1.569604 -1.530453
H  3.371248 -2.413636 -1.526371
H  3.250613 -0.683465 -1.798582
C  1.550285 -1.804654 -2.506211
C  1.119257 -3.09451 -2.813203
C  0.875714 -0.725961 -3.078022
C  0.030915 -3.311546 -3.644687
H  1.655827 -3.954651 -2.42219
C  -0.219527 -0.925801 -3.902725
H  1.206658 0.286568 -2.873408
C  -0.649533 -2.222737 -4.183531
H  -0.293078 -4.313535 -3.897188
H  -0.734196 -0.075205 -4.33708
O  -1.730485 -2.487812 -4.958503
H  -2.059675 -1.682574 -5.366955
totalener: -1047.10731974 hartree
nucrepener: 1843.88718325 hartree
electener: -2890.99450299 hartree
oneelecener: -5070.38512780 hartree
twoeener: 2179.39062481 hartree
kineticenergy: 1041.98633422 hartree
exchangeener: -91.587421175873 hartree
correlationener: -6.618844341220 hartree
xcener: -98.206265517093 hartree
temp: 298.15 k
press: 1.00 atm
thermalcorrenthalpy: 0.00094421 hartree
totalenthalpy: -1046.85470142 hartree
totalentropycorr: -0.06331670 hartree
gibbsenthalpy: -1046.91801813 hartree
gibbsminuselec: 0.27926223 hartree
chargesum: 1.0000000
charge: -0.206922 0.200826 -0.000263 0.303989 0.158785 0.071850 -0.387744 0.202196 -0.121080 -0.312813 -0.151115 0.054427 0.142979 0.213049 0.120986 0.013951 -0.283692 0.177578 -0.218569 0.240292 -0.042863 0.222765 0.234537 0.231450 -0.239894 0.132391 0.162042 0.038306 -0.199674 -0.183741 -0.136762 0.134178 -0.108285 0.160991 0.159187 0.150527 0.126355 -0.284238 0.224018
charge: 0.326299 -0.007024 -0.036786 -0.418940 0.043830 0.026605 0.074452 -0.380030 -0.067978 0.118781 0.337654 0.019581 0.015969 0.002056 -0.403114 -0.033790 0.127000 0.047853 0.405741 -0.071969 0.609650 0.024913 0.056486 0.053262 0.002957 0.035395 0.056090 -0.112858 -0.021572 0.013265 -0.007074 0.022618 -0.010610 0.036799 -0.206916 0.030709 0.026610 0.364534 -0.100444
qa: -0.2069 0.2008 -0.0003 0.3040 0.1588 0.0718 -0.3877 0.2022 -0.1211 -0.3128 -0.1511 0.0544 0.1430 0.2130 0.1210 0.0140 -0.2837 0.1776 -0.2186 0.2403 -0.0429 0.2228 0.2345 0.2315 -0.2399 0.1324 0.1620 0.0383 -0.1997 -0.1837 -0.1368 0.1342 -0.1083 0.1610 0.1592 0.1505 0.1264 -0.2842 0.2240
va: 3.1511 1.0081 3.7893 4.2445 1.0026 1.0375 2.0452 4.3750 3.8415 2.2091 3.1200 0.9833 0.9872 1.0257 4.4377 3.6893 2.2460 1.0065 2.3027 1.0163 3.6332 1.0435 0.9707 0.9757 3.8982 1.0034 1.0120 3.4850 3.9385 4.0263 3.9395 1.0028 3.8813 1.0031 4.0081 1.0076 1.0058 2.2071 1.0212
dispcorr: -0.090222167 hartree
energy: -1047.203186661954
dipole: 5.86650 -5.04990 0.81660 -5.18798 2.48280 -2.70518 0.07742 1.22479 1.30221
magnitude: 3.11137 au
magnitude: 7.90847 debye
zeropoint: 0.32511383 hartree
thermalvibcorrection: 0.01733514 hartree
thermalrotcorrection: 0.00141627 hartree
thermaltrasncorrection: 0.00141627 hartree
thermaltotal: -1046.85790514 hartree
thermalcorr: 0.02016769 hartree
nonthermalcorr: 0.32511383 hartree
totalcorr: 0.34528152 hartree
totalenthalpy: -1046.85696094 hartree
