program: Orca
programVersion: 5.0.2
elementType: N H C C H H O C C O N H H H C C O H O H N H H H C H H C C C C H C H C H H O H
charge: 1
multiplicity: 1
keywords: wB97X-D3BJ Opt Freq def2-TZVPP def2/J RIJCOSX VeryTightSCF
keywords: PAL8 defgrid3 VeryTightOpt
frequency: 0.00 0.00 0.00 0.00 0.00 0.00 19.38 29.89 57.15 67.34 71.38 79.65 85.48 88.35 115.77 134.17 167.77 176.40 222.11 240.66 268.81 284.15 296.92 308.90 354.26 374.74 410.76 422.97 434.50 441.40 473.31 479.67 512.02 531.03 540.53 555.03 585.80 605.03 640.65 648.62 659.11 668.15 715.15 721.49 735.70 756.67 797.79 822.56 860.24 865.46 874.41 884.01 888.90 939.04 965.72 988.55 997.22 1012.27 1022.21 1042.06 1077.25 1101.63 1141.80 1163.25 1168.41 1185.82 1207.29 1216.05 1220.44 1233.04 1256.70 1271.47 1301.50 1319.73 1324.45 1334.50 1338.74 1351.18 1375.04 1382.02 1394.69 1404.16 1413.58 1438.54 1473.20 1482.07 1492.20 1500.36 1505.12 1524.30 1537.15 1583.88 1640.61 1659.61 1674.98 1705.02 1768.42 1802.53 1841.12 2690.29 3054.11 3098.90 3107.87 3118.77 3145.28 3151.50 3159.23 3175.40 3183.72 3216.72 3228.26 3518.21 3520.25 3587.42 3645.29 3777.42 3810.37
frequency: 19.38 29.89 57.15 67.34 71.38 79.65 85.48 88.35 115.77 134.17 167.77 176.40 222.11 240.66 268.81 284.15 296.92 308.90 354.26 374.74 410.76 422.97 434.50 441.40 473.31 479.67 512.02 531.03 540.53 555.03 585.80 605.03 640.65 648.62 659.11 668.15 715.15 721.49 735.70 756.67 797.79 822.56 860.24 865.46 874.41 884.01 888.90 939.04 965.72 988.55 997.22 1012.27 1022.21 1042.06 1077.25 1101.63 1141.80 1163.25 1168.41 1185.82 1207.29 1216.05 1220.44 1233.04 1256.70 1271.47 1301.50 1319.73 1324.45 1334.50 1338.74 1351.18 1375.04 1382.02 1394.69 1404.16 1413.58 1438.54 1473.20 1482.07 1492.20 1500.36 1505.12 1524.30 1537.15 1583.88 1640.61 1659.61 1674.98 1705.02 1768.42 1802.53 1841.12 2690.29 3054.11 3098.90 3107.87 3118.77 3145.28 3151.50 3159.23 3175.40 3183.72 3216.72 3228.26 3518.21 3520.25 3587.42 3645.29 3777.42 3810.37
formula: C13H18N3O5
InChI: InChI=1S/C13H18N3O5/c14-10(5-8-1-3-9(17)4-2-8)13(21)16-6-11(18)15-7-12(19)20/h1-4,10,15-17,19H,5-7H2,14H3
39 atoms
N  -3.473616 -0.846129 0.164023
H  -4.305727 -0.321078 -0.056379
C  -3.638449 -2.173551 0.700614
C  -3.644212 -3.332723 -0.283016
H  -2.85691 -2.405111 1.427039
H  -4.579488 -2.227462 1.247384
O  -4.044376 -4.424229 0.031077
C  -2.33253 -0.13495 0.008736
C  -1.001541 -0.857187 0.251583
O  -2.33396 1.036283 -0.313983
N  0.017521 0.173847 0.278953
H  -0.842515 -1.582924 -0.548776
H  -1.025821 -1.402303 1.194372
H  -0.36659 1.115376 0.30883
C  1.331445 0.100156 0.142785
C  2.043699 -1.243138 -0.177225
O  2.062807 1.094033 0.20713
H  1.708524 -1.5712 -1.16014
O  -3.126016 -3.037276 -1.477697
H  -3.133838 -3.845482 -2.011297
N  3.473388 -0.798043 -0.315797
H  3.862118 -0.966304 -1.239449
H  3.359114 0.256406 -0.130788
H  4.082612 -1.219183 0.38087
C  1.901133 -2.395955 0.838974
H  1.625484 -2.000358 1.818589
H  2.884947 -2.861744 0.960848
C  0.913599 -3.45462 0.399481
C  -0.083674 -3.905212 1.255319
C  0.982162 -4.005473 -0.880075
C  -1.034101 -4.823892 0.831244
H  -0.131786 -3.529219 2.272862
C  0.041507 -4.916421 -1.322813
H  1.779306 -3.721462 -1.5612
C  -0.998581 -5.301133 -0.477795
H  -1.813014 -5.158329 1.506323
H  0.085742 -5.329144 -2.322937
O  -1.942023 -6.12335 -0.990073
H  -2.729439 -6.113176 -0.432473
totalener: -1047.11339528 hartree
nucrepener: 1803.04417893 hartree
electener: -2850.15757421 hartree
oneelecener: -4989.21910688 hartree
twoeener: 2139.06153267 hartree
kineticenergy: 1041.96008307 hartree
exchangeener: -91.587785283231 hartree
correlationener: -6.623155760514 hartree
xcener: -98.210941043745 hartree
temp: 298.15 k
press: 1.00 atm
thermalcorrenthalpy: 0.00094421 hartree
totalenthalpy: -1046.86138576 hartree
totalentropycorr: -0.06310177 hartree
gibbsenthalpy: -1046.92448753 hartree
gibbsminuselec: 0.27604208 hartree
totalenthalpy: -1046.86375978 hartree
chargesum: 1.0000000
charge: -0.176265 0.200694 -0.121429 0.324985 0.107229 0.170091 -0.339697 0.234341 -0.115840 -0.339156 -0.127850 0.131237 0.126902 0.208738 0.235653 -0.026502 -0.347336 0.144799 -0.253668 0.244437 -0.057879 0.229463 0.231254 0.219908 -0.182228 0.133010 0.121066 0.046784 -0.244158 -0.170975 -0.124603 0.147288 -0.109575 0.115254 0.120955 0.149206 0.143915 -0.287586 0.237535
charge: 0.334745 -0.001853 -0.045669 -0.441456 0.033727 0.047715 0.121139 -0.377311 -0.024994 0.105165 0.363618 0.034757 0.020741 0.004031 -0.351620 -0.025502 0.140397 0.036531 0.379812 -0.076987 0.600167 0.038900 -0.032301 0.035755 0.003083 0.040191 0.033212 -0.111684 -0.013521 -0.014776 -0.013274 0.025486 0.004721 0.020234 -0.205048 0.027174 0.031361 0.364284 -0.110949
qa: -0.1763 0.2007 -0.1214 0.3250 0.1072 0.1701 -0.3397 0.2343 -0.1158 -0.3392 -0.1278 0.1312 0.1269 0.2087 0.2357 -0.0265 -0.3473 0.1448 -0.2537 0.2444 -0.0579 0.2295 0.2313 0.2199 -0.1822 0.1330 0.1211 0.0468 -0.2442 -0.1710 -0.1246 0.1473 -0.1096 0.1153 0.1210 0.1492 0.1439 -0.2876 0.2375
va: 3.1562 1.0084 3.8321 4.2734 1.0141 0.9978 2.1675 4.3467 3.8638 2.1769 3.2323 1.0039 0.9935 1.0335 4.2923 3.7909 2.1822 1.0036 2.2340 1.0162 3.5817 0.9790 1.0694 0.9892 3.7957 1.0035 1.0012 3.5730 3.9393 4.0057 3.8088 0.9967 3.9807 1.0030 4.0624 1.0020 1.0091 2.2078 1.0259
dispcorr: -0.087086034 hartree
energy: -1047.208166148507
dipole: 10.13748 -6.52561 3.61187 -1.17052 1.56275 0.39223 2.76236 -2.57201 0.19035
magnitude: 3.63809 au
magnitude: 9.24729 debye
zeropoint: 0.32336791 hartree
thermalvibcorrection: 0.01728658 hartree
thermalrotcorrection: 0.00141627 hartree
thermaltrasncorrection: 0.00141627 hartree
thermaltotal: -1046.86467912 hartree
thermalcorr: 0.02011912 hartree
nonthermalcorr: 0.32336791 hartree
totalcorr: 0.34348703 hartree
totalenthalpy: -1046.86373491 hartree
