program: Orca
programVersion: 5.0.2
elementType: N H C C H H O C C O N H H H C C O H O H N H H H C H H C C C C H C H C H H O H
charge: 1
multiplicity: 1
keywords: wB97X-D3BJ Opt Freq def2-TZVPP def2/J RIJCOSX VeryTightSCF
keywords: PAL8 defgrid3 VeryTightOpt
frequency: 0.00 0.00 0.00 0.00 0.00 0.00 7.81 20.59 29.63 42.53 54.01 64.93 77.42 78.90 116.67 154.75 177.22 194.86 224.92 261.80 297.53 301.66 305.00 341.70 357.84 360.88 382.32 411.13 429.35 435.95 442.12 485.15 499.42 522.47 533.33 543.28 563.30 595.41 618.12 658.05 659.49 681.25 715.45 736.22 750.83 762.00 794.69 828.59 854.43 859.69 871.99 873.84 888.17 909.61 960.54 977.87 984.57 1013.40 1014.27 1041.77 1074.94 1098.76 1144.28 1148.94 1168.81 1186.81 1198.52 1201.41 1207.02 1248.84 1272.20 1290.97 1296.63 1318.04 1333.07 1345.24 1349.96 1370.27 1379.02 1393.95 1396.24 1421.07 1444.56 1462.00 1471.61 1486.16 1495.44 1500.67 1511.80 1520.04 1535.97 1580.47 1616.16 1672.70 1685.15 1701.85 1750.97 1788.43 1883.13 3096.90 3112.92 3116.76 3123.88 3167.18 3170.68 3178.55 3187.05 3190.53 3203.56 3231.78 3291.66 3457.92 3516.56 3611.31 3634.87 3792.00 3877.84
frequency: 7.81 20.59 29.63 42.53 54.01 64.93 77.42 78.90 116.67 154.75 177.22 194.86 224.92 261.80 297.53 301.66 305.00 341.70 357.84 360.88 382.32 411.13 429.35 435.95 442.12 485.15 499.42 522.47 533.33 543.28 563.30 595.41 618.12 658.05 659.49 681.25 715.45 736.22 750.83 762.00 794.69 828.59 854.43 859.69 871.99 873.84 888.17 909.61 960.54 977.87 984.57 1013.40 1014.27 1041.77 1074.94 1098.76 1144.28 1148.94 1168.81 1186.81 1198.52 1201.41 1207.02 1248.84 1272.20 1290.97 1296.63 1318.04 1333.07 1345.24 1349.96 1370.27 1379.02 1393.95 1396.24 1421.07 1444.56 1462.00 1471.61 1486.16 1495.44 1500.67 1511.80 1520.04 1535.97 1580.47 1616.16 1672.70 1685.15 1701.85 1750.97 1788.43 1883.13 3096.90 3112.92 3116.76 3123.88 3167.18 3170.68 3178.55 3187.05 3190.53 3203.56 3231.78 3291.66 3457.92 3516.56 3611.31 3634.87 3792.00 3877.84
formula: C13H18N3O5
InChI: InChI=1S/C13H18N3O5/c14-10(5-8-1-3-9(17)4-2-8)13(21)16-6-11(18)15-7-12(19)20/h1-4,10,15-17,19H,5-7H2,14H3
39 atoms
N  -1.376114 -1.076408 2.873956
H  -1.087798 -1.180771 3.835348
C  -2.798375 -1.007628 2.605197
C  -3.408259 0.390657 2.584318
H  -3.043753 -1.486843 1.655908
H  -3.327659 -1.571474 3.371286
O  -4.58354 0.583137 2.681657
C  -0.372313 -0.808372 2.026381
C  -0.706127 -0.605417 0.544984
O  0.796384 -0.782241 2.40897
N  0.248029 0.260853 -0.113665
H  -1.683225 -0.148257 0.418882
H  -0.755078 -1.588271 0.073792
H  -0.021559 1.234724 -0.138768
C  1.60259 0.153204 -0.08992
C  2.340287 -1.199247 -0.084549
O  2.32717 1.128687 -0.136147
H  3.021276 -1.125958 -0.933956
O  -2.491196 1.362574 2.406805
H  -2.963253 2.207179 2.411293
N  3.201747 -1.112029 1.142398
H  3.806309 -1.932753 1.212482
H  3.750031 -0.250973 1.101235
H  2.555964 -1.059807 1.946916
C  1.659459 -2.565292 -0.130897
H  1.044165 -2.601275 -1.032314
H  1.012566 -2.706983 0.732776
C  2.705538 -3.657937 -0.15127
C  2.976981 -4.40328 0.991993
C  3.460246 -3.90829 -1.300707
C  3.973655 -5.37289 0.999919
H  2.389701 -4.246433 1.892368
C  4.452248 -4.869499 -1.309623
H  3.259036 -3.35303 -2.211865
C  4.714844 -5.608396 -0.153804
H  4.162399 -5.95173 1.897719
H  5.02963 -5.073196 -2.202536
O  5.696432 -6.535883 -0.225849
H  5.778789 -7.009844 0.605643
totalener: -1047.12788845 hartree
nucrepener: 1689.54335466 hartree
electener: -2736.67124311 hartree
oneelecener: -4762.70365559 hartree
twoeener: 2026.03241248 hartree
kineticenergy: 1041.98017477 hartree
exchangeener: -91.586244503907 hartree
correlationener: -6.613158264889 hartree
xcener: -98.199402768796 hartree
temp: 298.15 k
press: 1.00 atm
thermalcorrenthalpy: 0.00094421 hartree
totalenthalpy: -1046.86816946 hartree
totalentropycorr: -0.06397482 hartree
gibbsenthalpy: -1046.93214428 hartree
gibbsminuselec: 0.27859598 hartree
totalenthalpy: -1046.87000835 hartree
chargesum: 1.0000000
charge: -0.165473 0.200621 -0.111287 0.276117 0.128480 0.157966 -0.255185 0.303259 -0.099602 -0.447795 -0.180664 0.139613 0.135198 0.191326 0.199088 -0.032910 -0.327871 0.177332 -0.281249 0.243925 -0.053164 0.232122 0.238798 0.244879 -0.159547 0.138563 0.114898 -0.010563 -0.254814 -0.149735 -0.126778 0.139786 -0.152190 0.135762 0.202433 0.116004 0.144367 -0.268543 0.216837
charge: 0.345598 0.000428 -0.038129 -0.445108 0.038791 0.047761 0.151661 -0.364653 -0.043733 0.080010 0.328014 0.032390 0.032464 0.000695 -0.385366 -0.045323 0.107361 0.051489 0.353500 -0.077624 0.619256 0.041953 0.050844 0.008221 -0.009395 0.042497 0.029980 -0.114536 -0.022242 -0.000818 -0.016800 0.022808 0.015297 0.028459 -0.190125 0.021697 0.033041 0.371802 -0.102165
qa: -0.1655 0.2006 -0.1113 0.2761 0.1285 0.1580 -0.2552 0.3033 -0.0996 -0.4478 -0.1807 0.1396 0.1352 0.1913 0.1991 -0.0329 -0.3279 0.1773 -0.2812 0.2439 -0.0532 0.2321 0.2388 0.2449 -0.1595 0.1386 0.1149 -0.0106 -0.2548 -0.1497 -0.1268 0.1398 -0.1522 0.1358 0.2024 0.1160 0.1444 -0.2685 0.2168
va: 3.2016 1.0067 3.8314 4.3091 0.9990 1.0019 2.2516 4.1432 3.9282 2.0385 3.1629 1.0085 0.9880 1.0147 4.3625 3.8038 2.1841 1.0091 2.1700 1.0130 3.5981 0.9873 0.9902 1.0216 3.8062 0.9996 1.0056 3.5681 3.9888 4.0303 3.9435 1.0056 4.0250 1.0026 4.0864 1.0067 1.0090 2.2328 1.0260
dispcorr: -0.083504648 hartree
energy: -1047.216339013906
dipole: 2.78128 -2.31994 0.46134 -4.92703 4.54763 -0.37940 -1.15574 2.02481 0.86907
magnitude: 1.05455 au
magnitude: 2.68045 debye
zeropoint: 0.32505520 hartree
thermalvibcorrection: 0.01744498 hartree
thermalrotcorrection: 0.00141627 hartree
thermaltrasncorrection: 0.00141627 hartree
thermaltotal: -1046.87100629 hartree
thermalcorr: 0.02027752 hartree
nonthermalcorr: 0.32505520 hartree
totalcorr: 0.34533272 hartree
totalenthalpy: -1046.87006208 hartree
