program: Orca
programVersion: 5.0.2
elementType: N H C C H H O C C O N H H H C C O H O H N H H H C H H C C C C H C H C H H O H
charge: 1
multiplicity: 1
keywords: wB97X-D3BJ Opt Freq def2-TZVPP def2/J RIJCOSX VeryTightSCF
keywords: PAL8 defgrid3 VeryTightOpt
frequency: 0.00 0.00 0.00 0.00 0.00 0.00 18.78 27.58 36.27 46.19 54.91 67.36 85.48 106.81 119.84 151.15 158.11 195.19 248.69 271.26 293.25 294.41 322.42 337.75 355.76 367.46 370.72 404.87 421.45 428.03 434.90 486.36 511.56 527.05 529.11 560.98 568.27 610.63 646.61 659.75 666.05 692.32 723.49 744.00 753.70 787.60 792.93 805.80 847.86 874.16 875.83 882.16 888.38 943.92 962.82 978.65 985.67 1017.09 1019.12 1036.22 1043.44 1104.36 1140.60 1151.64 1158.56 1165.23 1198.38 1200.48 1206.81 1232.63 1247.90 1268.36 1291.09 1326.61 1328.92 1336.60 1346.09 1356.87 1368.39 1374.63 1393.53 1453.16 1459.36 1463.85 1477.09 1489.69 1494.87 1501.07 1507.15 1524.18 1529.49 1581.20 1623.35 1676.77 1686.69 1704.20 1746.83 1794.35 1848.21 3069.15 3098.87 3118.69 3130.74 3167.91 3178.87 3194.97 3198.90 3200.66 3204.38 3230.54 3280.37 3437.81 3553.05 3605.93 3634.36 3793.07 3881.62
frequency: 18.78 27.58 36.27 46.19 54.91 67.36 85.48 106.81 119.84 151.15 158.11 195.19 248.69 271.26 293.25 294.41 322.42 337.75 355.76 367.46 370.72 404.87 421.45 428.03 434.90 486.36 511.56 527.05 529.11 560.98 568.27 610.63 646.61 659.75 666.05 692.32 723.49 744.00 753.70 787.60 792.93 805.80 847.86 874.16 875.83 882.16 888.38 943.92 962.82 978.65 985.67 1017.09 1019.12 1036.22 1043.44 1104.36 1140.60 1151.64 1158.56 1165.23 1198.38 1200.48 1206.81 1232.63 1247.90 1268.36 1291.09 1326.61 1328.92 1336.60 1346.09 1356.87 1368.39 1374.63 1393.53 1453.16 1459.36 1463.85 1477.09 1489.69 1494.87 1501.07 1507.15 1524.18 1529.49 1581.20 1623.35 1676.77 1686.69 1704.20 1746.83 1794.35 1848.21 3069.15 3098.87 3118.69 3130.74 3167.91 3178.87 3194.97 3198.90 3200.66 3204.38 3230.54 3280.37 3437.81 3553.05 3605.93 3634.36 3793.07 3881.62
formula: C13H18N3O5
InChI: InChI=1S/C13H18N3O5/c14-10(5-8-1-3-9(17)4-2-8)13(21)16-6-11(18)15-7-12(19)20/h1-4,10,15-17,19H,5-7H2,14H3
39 atoms
N  -2.561626 0.116264 -1.702228
H  -2.443343 0.33687 -2.67983
C  -3.776229 0.573758 -1.063926
C  -3.556216 1.809826 -0.199595
H  -4.510782 0.801268 -1.83445
H  -4.224041 -0.200407 -0.436067
O  -2.485521 2.157231 0.226456
C  -1.430681 -0.285581 -1.098556
C  -1.448065 -0.616839 0.396818
O  -0.387261 -0.423334 -1.736796
N  -0.391587 0.100508 1.077591
H  -1.317115 -1.694455 0.504365
H  -2.38682 -0.366594 0.878922
H  -0.620694 1.048898 1.345342
C  0.925816 -0.09734 0.872978
C  1.416159 -1.440256 0.308399
O  1.78079 0.738567 1.10618
H  0.620471 -2.09504 -0.030792
O  -4.709361 2.42453 0.0539
H  -4.540089 3.18079 0.633349
N  2.167805 -1.017212 -0.922456
H  2.726976 -1.769518 -1.318654
H  1.449927 -0.697033 -1.594421
H  2.77096 -0.230163 -0.662455
C  2.32011 -2.15632 1.30739
H  3.127764 -1.48463 1.604877
H  2.762247 -3.033129 0.824564
C  1.503543 -2.573721 2.507304
C  0.795113 -3.770635 2.502127
C  1.397002 -1.739467 3.619864
C  -0.00336 -4.13448 3.577562
H  0.876566 -4.446253 1.655662
C  0.604986 -2.088334 4.699232
H  1.946001 -0.80404 3.644542
C  -0.099918 -3.290354 4.681002
H  -0.537677 -5.07877 3.565212
H  0.52905 -1.448898 5.569595
O  -0.858612 -3.583192 5.76664
H  -1.253001 -4.453826 5.67406
totalener: -1047.13868781 hartree
nucrepener: 1752.56345520 hartree
electener: -2799.70214301 hartree
oneelecener: -4889.21563502 hartree
twoeener: 2089.51349201 hartree
kineticenergy: 1042.89546546 hartree
exchangeener: -91.750691670176 hartree
correlationener: -6.625495803531 hartree
xcener: -98.376187473707 hartree
temp: 298.15 k
press: 1.00 atm
thermalcorrenthalpy: 0.00094421 hartree
totalenthalpy: -1046.87781681 hartree
totalentropycorr: -0.06635340 hartree
gibbsenthalpy: -1046.94417021 hartree
gibbsminuselec: 0.27905333 hartree
totalenthalpy: -1046.87918815 hartree
totalenthalpy: -1046.88128008 hartree
chargesum: 1.0000000
charge: -0.163596 0.197634 -0.113957 0.319840 0.150300 0.138944 -0.328049 0.317797 -0.087300 -0.461324 -0.136497 0.122901 0.126784 0.207922 0.123811 -0.007749 -0.328956 0.133774 -0.245333 0.249593 -0.052057 0.222940 0.254859 0.234166 -0.154042 0.137669 0.109849 0.078848 -0.248904 -0.177042 -0.122778 0.121836 -0.122991 0.140708 0.176919 0.108608 0.138212 -0.276916 0.213574
charge: 0.345955 0.000224 -0.041822 -0.440137 0.044988 0.038170 0.117286 -0.352566 -0.036269 0.070493 0.346298 0.033076 0.029820 0.000832 -0.390918 -0.050746 0.101600 0.027756 0.389572 -0.072010 0.613988 0.043272 0.013296 0.050306 -0.003345 0.040721 0.031833 -0.101391 -0.009856 0.008430 -0.020723 0.022708 0.006075 0.030661 -0.192236 0.018961 0.029644 0.362623 -0.106571
qa: -0.1636 0.1976 -0.1140 0.3198 0.1503 0.1389 -0.3280 0.3178 -0.0873 -0.4613 -0.1365 0.1229 0.1268 0.2079 0.1238 -0.0077 -0.3290 0.1338 -0.2453 0.2496 -0.0521 0.2229 0.2549 0.2342 -0.1540 0.1377 0.1098 0.0788 -0.2489 -0.1770 -0.1228 0.1218 -0.1230 0.1407 0.1769 0.1086 0.1382 -0.2769 0.2136
va: 3.2125 1.0080 3.8545 4.2529 1.0067 0.9979 2.1479 4.1674 3.9102 2.0442 3.0898 1.0076 1.0089 1.0144 4.4016 3.9292 2.2013 1.0245 2.2587 1.0091 3.5886 0.9780 1.0118 0.9970 3.8729 1.0211 1.0085 3.6073 4.0475 4.0293 3.9169 1.0070 3.9749 1.0081 4.0888 1.0065 1.0090 2.2193 1.0279
dispcorr: -0.083986875 hartree
energy: -1047.228371258411
dipole: 3.14022 -3.55646 -0.41624 -6.66586 5.90357 -0.76229 -3.59890 0.72027 -2.87863
magnitude: 3.00680 au
magnitude: 7.64268 debye
zeropoint: 0.32527511 hartree
thermalvibcorrection: 0.01725703 hartree
thermalrotcorrection: 0.00141627 hartree
thermaltrasncorrection: 0.00141627 hartree
thermaltotal: -1046.88300657 hartree
thermalcorr: 0.02008958 hartree
nonthermalcorr: 0.32527511 hartree
totalcorr: 0.34536468 hartree
totalenthalpy: -1046.88206236 hartree
