program: Orca
programVersion: 5.0.2
elementType: N H C C H H O C C O N H H H C C O H O H N H H H C H H C C C C H C H C H H O H
charge: 1
multiplicity: 1
keywords: wB97X-D3BJ Opt Freq def2-TZVPP def2/J RIJCOSX VeryTightSCF
keywords: PAL8 defgrid3 VeryTightOpt
frequency: 0.00 0.00 0.00 0.00 0.00 0.00 13.45 29.76 48.29 61.40 65.77 81.04 89.87 110.11 117.22 141.68 170.77 188.95 219.48 228.70 239.36 269.84 313.65 343.09 377.77 387.98 420.09 433.41 436.13 439.69 446.00 469.44 506.03 517.05 536.94 564.71 587.52 600.10 623.75 659.22 668.28 679.44 725.13 745.51 768.64 774.18 804.42 838.13 866.66 868.29 882.09 894.76 908.83 919.42 963.64 981.99 992.69 1014.49 1016.83 1037.64 1043.52 1106.63 1123.11 1142.91 1145.86 1174.42 1196.35 1209.73 1228.73 1230.29 1248.66 1263.28 1280.08 1314.25 1329.11 1337.35 1345.52 1372.31 1377.96 1385.75 1408.01 1430.54 1452.44 1458.24 1492.45 1497.65 1498.94 1506.22 1509.55 1526.58 1540.10 1580.27 1669.45 1678.29 1696.43 1700.49 1790.99 1793.24 1820.49 3080.15 3087.79 3119.68 3147.49 3150.17 3157.05 3158.96 3176.20 3194.70 3209.67 3229.17 3237.42 3404.06 3527.70 3570.56 3637.84 3779.99 3874.00
frequency: 13.45 29.76 48.29 61.40 65.77 81.04 89.87 110.11 117.22 141.68 170.77 188.95 219.48 228.70 239.36 269.84 313.65 343.09 377.77 387.98 420.09 433.41 436.13 439.69 446.00 469.44 506.03 517.05 536.94 564.71 587.52 600.10 623.75 659.22 668.28 679.44 725.13 745.51 768.64 774.18 804.42 838.13 866.66 868.29 882.09 894.76 908.83 919.42 963.64 981.99 992.69 1014.49 1016.83 1037.64 1043.52 1106.63 1123.11 1142.91 1145.86 1174.42 1196.35 1209.73 1228.73 1230.29 1248.66 1263.28 1280.08 1314.25 1329.11 1337.35 1345.52 1372.31 1377.96 1385.75 1408.01 1430.54 1452.44 1458.24 1492.45 1497.65 1498.94 1506.22 1509.55 1526.58 1540.10 1580.27 1669.45 1678.29 1696.43 1700.49 1790.99 1793.24 1820.49 3080.15 3087.79 3119.68 3147.49 3150.17 3157.05 3158.96 3176.20 3194.70 3209.67 3229.17 3237.42 3404.06 3527.70 3570.56 3637.84 3779.99 3874.00
formula: C13H18N3O5
InChI: InChI=1S/C13H18N3O5/c14-10(5-8-1-3-9(17)4-2-8)13(21)16-6-11(18)15-7-12(19)20/h1-4,10,15-17,19H,5-7H2,14H3
39 atoms
N  -3.027212 0.74235 -0.084728
H  -3.769924 1.425263 -0.096212
C  -2.906736 -0.103793 1.0850
C  -1.869753 0.449618 2.055378
H  -3.874483 -0.136185 1.582662
H  -2.633994 -1.123528 0.816973
O  -0.711736 0.078921 2.114689
C  -2.092484 0.926961 -1.062494
C  -0.885248 -0.011142 -1.107418
O  -2.188936 1.806128 -1.888389
N  0.28435 0.853517 -1.102655
H  -0.956373 -0.594176 -2.029941
H  -0.891313 -0.694715 -0.269974
H  0.13905 1.707353 -1.629975
C  1.605652 0.589303 -0.930219
C  2.142354 -0.655846 -0.206962
O  2.465802 1.348143 -1.321737
H  2.932132 -0.275018 0.438918
O  -2.352643 1.41688 2.812107
H  -1.649501 1.777076 3.372538
N  1.174841 -1.379962 0.693616
H  1.695514 -1.930367 1.37517
H  0.52193 -0.761026 1.21501
H  0.624622 -2.034606 0.128574
C  2.711759 -1.658929 -1.223363
H  3.196552 -2.479158 -0.685858
H  3.487299 -1.132682 -1.778522
C  1.631163 -2.171551 -2.142018
C  0.877343 -3.301553 -1.817158
C  1.30813 -1.478515 -3.30797
C  -0.188697 -3.712428 -2.604463
H  1.155488 -3.912419 -0.960484
C  0.253585 -1.882455 -4.111171
H  1.889916 -0.609002 -3.594543
C  -0.507873 -2.996839 -3.756176
H  -0.760135 -4.599498 -2.361714
H  0.024016 -1.334845 -5.019262
O  -1.555832 -3.43655 -4.489664
H  -1.651302 -2.917051 -5.292402
totalener: -1047.10891360 hartree
nucrepener: 1843.92928712 hartree
electener: -2891.03820072 hartree
oneelecener: -5070.14726159 hartree
twoeener: 2179.10906087 hartree
kineticenergy: 1042.89015129 hartree
exchangeener: -91.744907821281 hartree
correlationener: -6.630745142566 hartree
xcener: -98.375652963846 hartree
temp: 298.15 k
press: 1.00 atm
thermalcorrenthalpy: 0.00094421 hartree
totalenthalpy: -1046.85342259 hartree
totalentropycorr: -0.06633616 hartree
gibbsenthalpy: -1046.91975876 hartree
gibbsminuselec: 0.27986939 hartree
totalenthalpy: -1046.85656263 hartree
chargesum: 1.0000000
charge: -0.201623 0.207547 -0.108939 0.367213 0.162329 0.125061 -0.383250 0.237767 -0.067127 -0.317687 -0.148169 0.125099 0.019070 0.202116 0.108733 0.041155 -0.288878 0.167322 -0.215872 0.249430 -0.076561 0.228200 0.233584 0.203705 -0.217598 0.131831 0.156040 0.070122 -0.261966 -0.215860 -0.132250 0.155855 -0.110809 0.156577 0.175828 0.147190 0.124303 -0.270833 0.221344
charge: 0.326662 -0.003047 -0.045917 -0.404209 0.045408 0.027910 0.116328 -0.382025 -0.041562 0.117827 0.326010 0.033346 -0.005210 0.005179 -0.400191 -0.039663 0.124893 0.047570 0.415389 -0.063863 0.604276 0.049772 -0.025215 0.028332 0.005525 0.034928 0.053710 -0.111203 -0.031536 0.011617 0.000512 0.020681 -0.008606 0.036294 -0.198152 0.030763 0.026416 0.371039 -0.099989
qa: -0.2016 0.2075 -0.1089 0.3672 0.1623 0.1251 -0.3832 0.2378 -0.0671 -0.3177 -0.1482 0.1251 0.0191 0.2021 0.1087 0.0412 -0.2889 0.1673 -0.2159 0.2494 -0.0766 0.2282 0.2336 0.2037 -0.2176 0.1318 0.1560 0.0701 -0.2620 -0.2159 -0.1322 0.1559 -0.1108 0.1566 0.1758 0.1472 0.1243 -0.2708 0.2213
va: 3.1328 1.0050 3.8987 4.1487 0.9995 0.9955 2.0697 4.3565 3.8776 2.2077 3.0741 1.0218 1.0368 1.0278 4.4227 3.7311 2.2384 1.0101 2.2991 1.0079 3.6000 0.9754 1.0659 1.0259 3.8974 1.0037 1.0148 3.4814 3.9816 4.0430 4.0120 0.9978 3.8661 1.0084 4.1042 1.0093 1.0060 2.2309 1.0227
dispcorr: -0.087119316 hartree
energy: -1047.202804675651
dipole: 3.27801 -3.46932 -0.19131 -7.52818 5.90736 -1.62083 3.03881 -0.18937 2.84945
magnitude: 3.28375 au
magnitude: 8.34663 debye
zeropoint: 0.32518124 hartree
thermalvibcorrection: 0.01721567 hartree
thermalrotcorrection: 0.00141627 hartree
thermaltrasncorrection: 0.00141627 hartree
thermaltotal: -1046.85757522 hartree
thermalcorr: 0.02004821 hartree
nonthermalcorr: 0.32518124 hartree
totalcorr: 0.34522946 hartree
totalenthalpy: -1046.85663101 hartree
