program: Orca
programVersion: 5.0.2
elementType: N H C H C C H H H O N H C H C C H H H O H H N H C H C C H H H O O H
charge: 1
multiplicity: 1
keywords: wB97X-D3BJ Opt Freq def2-TZVPP def2/J RIJCOSX VeryTightSCF
keywords: PAL8 defgrid3 VeryTightOpt
frequency: 0.00 0.00 0.00 0.00 0.00 0.00 21.61 28.76 47.27 59.51 63.37 72.15 97.43 105.14 145.97 206.06 218.48 230.03 236.24 250.83 260.38 271.51 305.13 325.50 353.04 384.54 404.79 407.82 447.30 508.97 534.46 582.17 597.98 647.13 659.73 689.79 721.13 757.60 767.75 777.51 829.18 879.13 909.78 941.26 962.93 970.06 1003.46 1024.06 1081.11 1088.23 1115.73 1131.47 1135.27 1147.67 1168.60 1185.35 1219.48 1227.30 1254.83 1282.96 1313.82 1328.14 1346.41 1363.98 1377.49 1401.26 1418.99 1425.70 1438.10 1443.26 1446.39 1491.83 1501.47 1505.90 1506.00 1508.32 1511.76 1578.31 1595.49 1642.72 1665.32 1771.62 1781.87 1853.33 2821.40 3071.40 3072.18 3083.03 3104.08 3132.23 3135.23 3151.98 3154.63 3164.47 3169.57 3171.58 3179.18 3513.91 3517.07 3580.72 3663.53 3807.34
frequency: 21.61 28.76 47.27 59.51 63.37 72.15 97.43 105.14 145.97 206.06 218.48 230.03 236.24 250.83 260.38 271.51 305.13 325.50 353.04 384.54 404.79 407.82 447.30 508.97 534.46 582.17 597.98 647.13 659.73 689.79 721.13 757.60 767.75 777.51 829.18 879.13 909.78 941.26 962.93 970.06 1003.46 1024.06 1081.11 1088.23 1115.73 1131.47 1135.27 1147.67 1168.60 1185.35 1219.48 1227.30 1254.83 1282.96 1313.82 1328.14 1346.41 1363.98 1377.49 1401.26 1418.99 1425.70 1438.10 1443.26 1446.39 1491.83 1501.47 1505.90 1506.00 1508.32 1511.76 1578.31 1595.49 1642.72 1665.32 1771.62 1781.87 1853.33 2821.40 3071.40 3072.18 3083.03 3104.08 3132.23 3135.23 3151.98 3154.63 3164.47 3169.57 3171.58 3179.18 3513.91 3517.07 3580.72 3663.53 3807.34
formula: C9H18N3O4
InChI: InChI=1S/C9H18N3O4/c1-4(10)7(13)11-5(2)8(14)12-6(3)9(15)16/h4-6,11-12,15H,1-3,10H3
34 atoms
N  3.476313 -0.933333 0.027729
H  3.991072 -1.137703 -0.824976
C  2.03266 -1.351049 -0.029134
H  1.853816 -1.827023 -0.99309
C  1.682225 -2.281929 1.122007
C  1.291741 0.005698 0.03566
H  1.861406 -1.794824 2.083314
H  0.627459 -2.551016 1.075981
H  2.262141 -3.20474 1.068778
O  1.981673 1.018083 0.186106
N  -0.020449 -0.029178 -0.062811
H  -0.545694 -0.896067 -0.140218
C  -0.882422 1.142775 0.024918
H  -0.572649 1.743561 0.883191
C  -0.837533 1.977689 -1.25558
C  -2.284731 0.566593 0.262038
H  -1.455479 2.870262 -1.157318
H  -1.217114 1.399661 -2.098762
H  0.185857 2.294982 -1.453594
O  -2.481941 -0.634397 0.15652
H  3.37187 0.120863 0.151605
H  3.971486 -1.340828 0.817696
N  -3.246821 1.455633 0.572442
H  -3.032351 2.434926 0.482165
C  -4.643913 1.078299 0.469244
H  -4.783794 0.129944 0.988359
C  -5.535398 2.152777 1.085058
C  -4.997777 0.854585 -1.000428
H  -5.40864 3.106914 0.567025
H  -6.581025 1.860108 1.008268
H  -5.284958 2.2871 2.137425
O  -4.301564 1.170285 -1.927784
O  -6.199711 0.278396 -1.125274
H  -6.386185 0.177525 -2.06818
totalener: -819.35746111 hartree
nucrepener: 1173.18995749 hartree
electener: -1992.54741860 hartree
oneelecener: -3429.36619616 hartree
twoeener: 1436.81877756 hartree
kineticenergy: 815.23928777 hartree
exchangeener: -71.640223803789 hartree
correlationener: -5.222517648298 hartree
xcener: -76.862741452087 hartree
temp: 298.15 k
press: 1.00 atm
thermalcorrenthalpy: 0.00094421 hartree
totalenthalpy: -819.10934787 hartree
totalentropycorr: -0.05884586 hartree
gibbsenthalpy: -819.16819373 hartree
gibbsminuselec: 0.24860542 hartree
totalenthalpy: -819.11033820 hartree
chargesum: 1.0000000
charge: -0.060749 0.233779 -0.035259 0.151392 -0.274077 0.276502 0.121065 0.114255 0.125936 -0.379083 -0.174747 0.184169 0.046742 0.120522 -0.279890 0.286043 0.092234 0.117242 0.111914 -0.397006 0.230724 0.227618 -0.196988 0.168975 0.093654 0.119194 -0.290424 0.278454 0.095370 0.120908 0.114431 -0.317540 -0.262309 0.236948
charge: 0.604606 0.043308 -0.047827 0.038306 0.036037 -0.371159 0.029119 0.035288 0.025641 0.117875 0.372784 -0.023086 -0.092317 0.036873 0.034374 -0.364225 0.019784 0.026646 0.018829 0.092284 -0.011412 0.043351 0.343490 -0.013845 -0.116913 0.043371 0.033231 -0.430334 0.018641 0.027688 0.020805 0.113948 0.377128 -0.082289
qa: -0.0607 0.2338 -0.0353 0.1514 -0.2741 0.2765 0.1211 0.1143 0.1259 -0.3791 -0.1747 0.1842 0.0467 0.1205 -0.2799 0.2860 0.0922 0.1172 0.1119 -0.3970 0.2307 0.2276 -0.1970 0.1690 0.0937 0.1192 -0.2904 0.2785 0.0954 0.1209 0.1144 -0.3175 -0.2623 0.2369
va: 3.5817 0.9761 3.9168 0.9957 3.9419 4.1570 0.9953 1.0126 0.9993 2.1475 3.3003 1.0567 3.8679 1.0134 3.9356 4.2059 1.0166 1.0084 1.0067 2.1245 1.0573 0.9797 3.2696 1.0243 3.8039 1.0222 3.9354 4.3105 0.9999 1.0122 1.0008 2.1745 2.2326 1.0197
dispcorr: -0.060136460 hartree
energy: -819.422024874703
dipole: 10.09321 -4.93136 5.16185 -1.34693 -0.38010 -1.72703 4.13940 -3.56885 0.57055
magnitude: 5.47292 au
magnitude: 13.91106 debye
zeropoint: 0.29264419 hartree
thermalvibcorrection: 0.01526739 hartree
thermalrotcorrection: 0.00141627 hartree
thermaltrasncorrection: 0.00141627 hartree
thermaltotal: -819.11128075 hartree
thermalcorr: 0.01809993 hartree
nonthermalcorr: 0.29264419 hartree
totalcorr: 0.31074413 hartree
totalenthalpy: -819.11033654 hartree
