program: Orca
programVersion: 5.0.2
elementType: N H C H C C H H H O N H C H C C H H H O H H N H C H C C H H H O O H
charge: 1
multiplicity: 1
keywords: wB97X-D3BJ Opt Freq def2-TZVPP def2/J RIJCOSX VeryTightSCF
keywords: PAL8 defgrid3 VeryTightOpt
frequency: 0.00 0.00 0.00 0.00 0.00 0.00 -5.32 37.92 43.37 58.87 74.83 87.69 113.75 144.07 155.29 207.22 221.96 225.94 236.67 257.79 271.52 290.62 300.28 351.07 373.70 383.21 394.81 412.29 476.39 490.93 533.32 557.68 597.09 639.70 654.87 675.98 729.41 754.43 764.10 800.86 826.87 876.83 909.06 938.00 958.45 969.91 1003.65 1022.62 1062.77 1094.05 1112.31 1132.81 1146.31 1147.35 1156.80 1195.54 1226.84 1228.64 1294.24 1305.44 1321.05 1326.28 1360.29 1370.12 1377.43 1393.20 1420.53 1431.09 1435.20 1447.79 1452.90 1498.58 1502.59 1506.80 1510.33 1510.62 1517.68 1560.59 1629.02 1642.77 1665.82 1776.44 1795.05 1810.00 2849.52 3068.09 3069.80 3071.76 3130.61 3135.37 3138.81 3153.45 3153.63 3159.32 3161.82 3169.26 3181.15 3514.71 3532.02 3581.35 3674.92 3809.09
frequency: 37.92 43.37 58.87 74.83 87.69 113.75 144.07 155.29 207.22 221.96 225.94 236.67 257.79 271.52 290.62 300.28 351.07 373.70 383.21 394.81 412.29 476.39 490.93 533.32 557.68 597.09 639.70 654.87 675.98 729.41 754.43 764.10 800.86 826.87 876.83 909.06 938.00 958.45 969.91 1003.65 1022.62 1062.77 1094.05 1112.31 1132.81 1146.31 1147.35 1156.80 1195.54 1226.84 1228.64 1294.24 1305.44 1321.05 1326.28 1360.29 1370.12 1377.43 1393.20 1420.53 1431.09 1435.20 1447.79 1452.90 1498.58 1502.59 1506.80 1510.33 1510.62 1517.68 1560.59 1629.02 1642.77 1665.82 1776.44 1795.05 1810.00 2849.52 3068.09 3069.80 3071.76 3130.61 3135.37 3138.81 3153.45 3153.63 3159.32 3161.82 3169.26 3181.15 3514.71 3532.02 3581.35 3674.92 3809.09
formula: C9H18N3O4
InChI: InChI=1S/C9H18N3O4/c1-4(10)7(13)11-5(2)8(14)12-6(3)9(15)16/h4-6,11-12,15H,1-3,10H3
34 atoms
N  3.459597 -0.994744 -0.312588
H  3.797892 -1.309557 -1.218184
C  2.030214 -1.376143 -0.038286
H  1.666257 -1.965418 -0.879665
C  1.905344 -2.138929 1.272729
C  1.321892 -0.00265 0.006238
H  2.248706 -1.526243 2.109551
H  0.862007 -2.395603 1.455193
H  2.479331 -3.066604 1.237484
O  2.027872 1.00071 -0.093704
N  0.008638 -0.018495 0.167144
H  -0.457844 -0.903588 0.337912
C  -0.761284 1.188298 0.516901
H  -0.049906 1.930714 0.874326
C  -1.541352 1.726433 -0.672846
C  -1.563308 0.716495 1.736662
H  -2.160681 0.956578 -1.139588
H  -0.847236 2.090276 -1.430616
H  -2.178352 2.557601 -0.367087
O  -1.024555 0.613865 2.81858
H  3.391087 0.067321 -0.294503
H  4.095089 -1.323932 0.410722
N  -2.828299 0.277769 1.496116
H  -3.167605 0.292305 0.549676
C  -3.391725 -0.718866 2.378551
H  -3.328124 -0.359942 3.406297
C  -4.844456 -1.013354 2.013982
C  -2.542452 -1.988888 2.302519
H  -4.92333 -1.386375 0.989487
H  -5.259046 -1.763386 2.6850
H  -5.434421 -0.101363 2.101703
O  -1.66562 -2.197041 1.491363
O  -2.893501 -2.868639 3.235539
H  -2.348541 -3.660902 3.13993
totalener: -819.35212756 hartree
nucrepener: 1229.45932276 hartree
electener: -2048.81145032 hartree
oneelecener: -3541.23964529 hartree
twoeener: 1492.42819496 hartree
kineticenergy: 815.25103682 hartree
exchangeener: -71.640959446805 hartree
correlationener: -5.224599125102 hartree
xcener: -76.865558571906 hartree
temp: 298.15 k
press: 1.00 atm
thermalcorrenthalpy: 0.00094421 hartree
totalenthalpy: -819.10570286 hartree
totalentropycorr: -0.05807306 hartree
gibbsenthalpy: -819.16377592 hartree
gibbsminuselec: 0.25013990 hartree
totalenthalpy: -819.10770274 hartree
totalenthalpy: -819.10772410 hartree
chargesum: 1.0000000
charge: -0.058810 0.232267 -0.041221 0.150298 -0.259805 0.270446 0.128251 0.101437 0.117936 -0.369000 -0.174898 0.195076 0.055752 0.130767 -0.281238 0.191722 0.071607 0.114966 0.129561 -0.332037 0.230844 0.228456 -0.193987 0.169664 0.088058 0.132832 -0.291682 0.337501 0.090973 0.121056 0.124235 -0.404840 -0.239955 0.233769
charge: 0.605421 0.042659 -0.047625 0.036911 0.036079 -0.366290 0.031124 0.031318 0.022519 0.124743 0.368981 -0.020660 -0.089390 0.044683 0.023791 -0.384700 0.010440 0.025453 0.027812 0.107146 -0.009137 0.044048 0.333092 -0.026689 -0.119633 0.048116 0.035770 -0.405258 0.017219 0.027163 0.025061 0.080734 0.399182 -0.080083
qa: -0.0588 0.2323 -0.0412 0.1503 -0.2598 0.2704 0.1283 0.1014 0.1179 -0.3690 -0.1749 0.1951 0.0558 0.1308 -0.2812 0.1917 0.0716 0.1150 0.1296 -0.3320 0.2308 0.2285 -0.1940 0.1697 0.0881 0.1328 -0.2917 0.3375 0.0910 0.1211 0.1242 -0.4048 -0.2400 0.2338
va: 3.5858 0.9768 3.9189 0.9962 3.9259 4.2040 0.9962 1.0428 1.0003 2.1589 3.2912 1.0449 3.7925 1.0320 3.9468 4.2907 1.0091 1.0044 1.0013 2.1911 1.0560 0.9790 3.1825 1.0227 3.8238 1.0175 3.9436 4.2215 0.9995 1.0119 0.9993 2.0686 2.2739 1.0233
dispcorr: -0.061994940 hartree
energy: -819.418951683467
dipole: 1.64402 1.52122 3.16524 -2.36626 0.41333 -1.95293 -6.24334 3.98583 -2.25751
magnitude: 4.35075 au
magnitude: 11.05872 debye
zeropoint: 0.29329814 hartree
thermalvibcorrection: 0.01410710 hartree
thermalrotcorrection: 0.00141627 hartree
thermaltrasncorrection: 0.00141627 hartree
thermaltotal: -819.10871390 hartree
thermalcorr: 0.01693964 hartree
nonthermalcorr: 0.29329814 hartree
totalcorr: 0.31023778 hartree
totalenthalpy: -819.10776969 hartree
