program: Orca
programVersion: 5.0.2
elementType: N H C H C C H H H O N H C H C C H H H O H H N H C H C C H H H O O H
charge: 1
multiplicity: 1
keywords: wB97X-D3BJ Opt Freq def2-TZVPP def2/J RIJCOSX VeryTightSCF
keywords: PAL8 defgrid3 VeryTightOpt
frequency: 0.00 0.00 0.00 0.00 0.00 0.00 24.94 45.72 54.31 61.26 67.70 86.94 108.09 138.35 149.64 202.05 207.85 210.43 238.41 244.04 265.93 284.92 291.77 343.73 353.33 365.81 399.26 418.03 472.34 502.27 558.07 579.44 596.12 607.12 638.25 674.47 698.16 753.18 768.43 778.14 819.45 841.57 876.51 940.18 958.66 997.26 1003.46 1017.12 1056.07 1072.81 1114.15 1123.40 1135.79 1143.41 1167.39 1201.03 1211.38 1224.62 1292.62 1302.00 1318.00 1337.83 1366.27 1379.88 1397.73 1425.61 1431.44 1441.16 1442.04 1448.74 1465.22 1491.83 1492.83 1498.29 1499.18 1500.00 1511.69 1521.89 1598.46 1640.43 1669.45 1769.46 1780.78 1854.70 2946.77 3075.47 3076.47 3086.85 3118.89 3138.92 3150.88 3160.14 3162.67 3173.26 3177.42 3183.35 3189.28 3510.81 3575.22 3640.72 3651.62 3799.17
frequency: 24.94 45.72 54.31 61.26 67.70 86.94 108.09 138.35 149.64 202.05 207.85 210.43 238.41 244.04 265.93 284.92 291.77 343.73 353.33 365.81 399.26 418.03 472.34 502.27 558.07 579.44 596.12 607.12 638.25 674.47 698.16 753.18 768.43 778.14 819.45 841.57 876.51 940.18 958.66 997.26 1003.46 1017.12 1056.07 1072.81 1114.15 1123.40 1135.79 1143.41 1167.39 1201.03 1211.38 1224.62 1292.62 1302.00 1318.00 1337.83 1366.27 1379.88 1397.73 1425.61 1431.44 1441.16 1442.04 1448.74 1465.22 1491.83 1492.83 1498.29 1499.18 1500.00 1511.69 1521.89 1598.46 1640.43 1669.45 1769.46 1780.78 1854.70 2946.77 3075.47 3076.47 3086.85 3118.89 3138.92 3150.88 3160.14 3162.67 3173.26 3177.42 3183.35 3189.28 3510.81 3575.22 3640.72 3651.62 3799.17
formula: C9H18N3O4
InChI: InChI=1S/C9H18N3O4/c1-4(10)7(13)11-5(2)8(14)12-6(3)9(15)16/h4-6,11-12,15H,1-3,10H3
34 atoms
N  -4.137375 1.231978 0.53226
H  -3.271279 1.837514 0.491678
C  -3.545983 -0.145534 0.402453
H  -3.948724 -0.773846 1.196334
C  -3.833963 -0.71691 -0.980381
C  -2.038371 0.113457 0.590567
H  -3.409042 -0.076771 -1.755923
H  -3.364521 -1.693489 -1.086628
H  -4.907841 -0.835655 -1.135205
O  -1.655089 1.280217 0.559561
N  -1.250731 -0.94628 0.737929
H  -1.658638 -1.856651 0.597127
C  0.183236 -0.838555 0.475971
H  0.604731 -0.099041 1.152044
C  0.82733 -2.202183 0.711758
C  0.353978 -0.435848 -1.000037
H  0.740566 -2.486867 1.76035
H  0.347256 -2.958337 0.085631
H  1.882065 -2.180223 0.447396
O  -0.500656 -0.758456 -1.808088
H  -4.77533 1.456022 -0.228271
H  -4.612106 1.384491 1.419297
N  1.499783 0.181765 -1.37808
H  1.549413 0.317757 -2.37603
C  2.422819 0.989517 -0.57624
H  3.194829 1.304418 -1.280006
C  1.778568 2.222003 0.043601
C  3.155425 0.142515 0.465291
H  0.996555 1.960028 0.753718
H  2.529741 2.811779 0.56942
H  1.338866 2.83428 -0.74435
O  2.967805 0.194905 1.650961
O  4.048946 -0.677002 -0.108648
H  4.502003 -1.163548 0.593539
totalener: -819.34107640 hartree
nucrepener: 1237.36953056 hartree
electener: -2056.71060696 hartree
oneelecener: -3557.24080117 hartree
twoeener: 1500.53019421 hartree
kineticenergy: 815.23249908 hartree
exchangeener: -71.633993828347 hartree
correlationener: -5.223732218376 hartree
xcener: -76.857726046723 hartree
temp: 298.15 k
press: 1.00 atm
thermalcorrenthalpy: 0.00094421 hartree
totalenthalpy: -819.09591802 hartree
totalentropycorr: -0.05824632 hartree
gibbsenthalpy: -819.15416434 hartree
gibbsminuselec: 0.25024193 hartree
totalenthalpy: -819.09651980 hartree
chargesum: 1.0000000
charge: -0.057546 0.232001 -0.038539 0.159020 -0.263480 0.282281 0.136509 0.106251 0.121044 -0.381642 -0.182360 0.175225 0.062026 0.134380 -0.288272 0.216152 0.128483 0.107922 0.100302 -0.370222 0.230697 0.234067 -0.186787 0.185364 0.046989 0.120066 -0.250984 0.235498 0.089775 0.112810 0.099400 -0.284165 -0.248613 0.236347
charge: 0.608872 0.001568 -0.047673 0.035804 0.038195 -0.365672 0.034506 0.034624 0.022816 0.129286 0.362772 -0.004955 -0.099106 0.030972 0.038548 -0.379842 0.024615 0.021660 0.024488 0.072827 0.045772 0.046827 0.341611 -0.007409 -0.123381 0.045231 0.028540 -0.440876 0.011879 0.026720 0.019031 0.131579 0.373514 -0.083342
qa: -0.0575 0.2320 -0.0385 0.1590 -0.2635 0.2823 0.1365 0.1063 0.1210 -0.3816 -0.1824 0.1752 0.0620 0.1344 -0.2883 0.2162 0.1285 0.1079 0.1003 -0.3702 0.2307 0.2341 -0.1868 0.1854 0.0470 0.1201 -0.2510 0.2355 0.0898 0.1128 0.0994 -0.2842 -0.2486 0.2363
va: 3.6000 1.0488 3.8993 0.9927 3.9346 4.1931 1.0014 1.0198 0.9983 2.1405 3.3103 1.0216 3.7892 1.0227 3.9389 4.2777 0.9996 1.0044 1.0284 2.1492 0.9767 0.9757 3.1451 1.0183 3.8666 1.0044 3.9470 4.3652 1.0184 1.0098 1.0069 2.1989 2.2450 1.0181
dispcorr: -0.063827276 hartree
energy: -819.408837890692
dipole: -11.64112 6.90035 -4.74077 0.05453 0.41290 0.46743 0.05199 0.50246 0.55445
magnitude: 4.79592 au
magnitude: 12.19025 debye
zeropoint: 0.29340102 hartree
thermalvibcorrection: 0.01515710 hartree
thermalrotcorrection: 0.00141627 hartree
thermaltrasncorrection: 0.00141627 hartree
thermaltotal: -819.09744722 hartree
thermalcorr: 0.01798965 hartree
nonthermalcorr: 0.29340102 hartree
totalcorr: 0.31139067 hartree
totalenthalpy: -819.09650301 hartree
