program: Orca
programVersion: 5.0.2
elementType: N H C H C C H H H O N H C H C C H H H O H H N H C H C C H H H O O H
charge: 1
multiplicity: 1
keywords: wB97X-D3BJ Opt Freq def2-TZVPP def2/J RIJCOSX VeryTightSCF
keywords: PAL8 defgrid3 VeryTightOpt
frequency: 0.00 0.00 0.00 0.00 0.00 0.00 25.89 42.36 44.94 73.67 85.94 111.93 149.30 171.39 192.83 209.66 224.65 241.50 259.53 272.61 288.69 297.89 321.17 329.73 366.21 381.04 389.42 402.91 436.92 517.38 558.05 588.08 605.34 619.67 624.85 675.86 710.84 754.88 786.18 796.37 807.61 838.61 863.21 936.13 960.43 993.38 995.36 1017.47 1062.72 1065.16 1106.63 1127.29 1138.18 1152.62 1180.58 1188.89 1211.61 1230.67 1299.59 1311.31 1322.27 1351.51 1371.51 1374.31 1393.44 1420.94 1427.54 1443.29 1449.11 1475.50 1497.72 1499.50 1505.94 1507.99 1516.86 1519.62 1535.74 1542.10 1566.30 1624.00 1666.48 1715.84 1795.08 1863.39 2962.46 3069.66 3075.70 3098.05 3106.89 3139.31 3147.07 3154.27 3161.37 3174.68 3181.48 3188.00 3217.70 3487.18 3560.22 3635.63 3669.97 3802.53
frequency: 25.89 42.36 44.94 73.67 85.94 111.93 149.30 171.39 192.83 209.66 224.65 241.50 259.53 272.61 288.69 297.89 321.17 329.73 366.21 381.04 389.42 402.91 436.92 517.38 558.05 588.08 605.34 619.67 624.85 675.86 710.84 754.88 786.18 796.37 807.61 838.61 863.21 936.13 960.43 993.38 995.36 1017.47 1062.72 1065.16 1106.63 1127.29 1138.18 1152.62 1180.58 1188.89 1211.61 1230.67 1299.59 1311.31 1322.27 1351.51 1371.51 1374.31 1393.44 1420.94 1427.54 1443.29 1449.11 1475.50 1497.72 1499.50 1505.94 1507.99 1516.86 1519.62 1535.74 1542.10 1566.30 1624.00 1666.48 1715.84 1795.08 1863.39 2962.46 3069.66 3075.70 3098.05 3106.89 3139.31 3147.07 3154.27 3161.37 3174.68 3181.48 3188.00 3217.70 3487.18 3560.22 3635.63 3669.97 3802.53
formula: C9H18N3O4
InChI: InChI=1S/C9H18N3O4/c1-4(10)7(13)11-5(2)8(14)12-6(3)9(15)16/h4-6,11-12,15H,1-3,10H3
34 atoms
N  3.290583 0.897838 0.919998
H  4.135063 0.835937 1.485131
C  3.444836 0.223379 -0.430382
H  4.011803 0.901606 -1.066562
C  4.146493 -1.109228 -0.263555
C  1.977028 0.232164 -0.890731
H  3.654496 -1.737235 0.482947
H  4.163813 -1.638874 -1.216757
H  5.183078 -0.963524 0.045248
O  1.447437 1.314602 -1.056245
N  1.310494 -0.938686 -0.855836
H  1.839081 -1.761418 -0.620933
C  -0.067685 -0.945537 -0.362051
H  -0.751732 -0.612337 -1.137188
C  -0.395549 -2.375157 0.068476
C  -0.112799 -0.018641 0.865012
H  -1.403924 -2.43157 0.464925
H  0.307722 -2.699872 0.838848
H  -0.31997 -3.040255 -0.793047
O  0.842782 -0.032477 1.656989
H  3.043954 1.877809 0.776932
H  2.468443 0.462654 1.413555
N  -1.177714 0.749955 1.120454
H  -1.096362 1.220276 2.009192
C  -2.273395 1.212418 0.269217
H  -2.829207 1.916012 0.893052
C  -1.81719 1.975772 -0.978346
C  -3.275273 0.110707 -0.054886
H  -1.132387 2.771055 -0.687705
H  -2.683734 2.413762 -1.470439
H  -1.299521 1.336035 -1.690601
O  -3.154756 -1.051655 0.219248
O  -4.339175 0.622414 -0.685213
H  -4.961735 -0.096921 -0.857943
totalener: -819.34203072 hartree
nucrepener: 1251.16475119 hartree
electener: -2070.50678191 hartree
oneelecener: -3584.27014392 hartree
twoeener: 1513.76336201 hartree
kineticenergy: 815.24583524 hartree
exchangeener: -71.640593021203 hartree
correlationener: -5.226781013031 hartree
xcener: -76.867374034234 hartree
temp: 298.15 k
press: 1.00 atm
thermalcorrenthalpy: 0.00094421 hartree
totalenthalpy: -819.09749780 hartree
totalentropycorr: -0.05732617 hartree
gibbsenthalpy: -819.15482397 hartree
gibbsminuselec: 0.25200551 hartree
totalenthalpy: -819.09834334 hartree
chargesum: 1.0000000
charge: -0.072431 0.225094 0.032204 0.163642 -0.308059 0.129241 0.105035 0.137247 0.121744 -0.334786 -0.154035 0.175650 0.092588 0.108923 -0.303492 0.258831 0.141755 0.097108 0.123048 -0.465424 0.236692 0.245263 -0.127713 0.184386 0.016157 0.119799 -0.261556 0.302054 0.103375 0.135110 0.097403 -0.311217 -0.255930 0.242295
charge: 0.607554 0.041532 -0.051197 0.042519 0.026392 -0.396698 0.021449 0.036945 0.028252 0.114765 0.345440 -0.021744 -0.094537 0.029647 0.038562 -0.338636 0.021835 0.016694 0.022367 0.067693 0.052436 -0.010525 0.367319 -0.001619 -0.112773 0.049021 0.033984 -0.432594 0.021230 0.025963 0.011749 0.132062 0.382270 -0.077358
qa: -0.0724 0.2251 0.0322 0.1636 -0.3081 0.1292 0.1050 0.1372 0.1217 -0.3348 -0.1540 0.1756 0.0926 0.1089 -0.3035 0.2588 0.1418 0.0971 0.1230 -0.4654 0.2367 0.2453 -0.1277 0.1844 0.0162 0.1198 -0.2616 0.3021 0.1034 0.1351 0.0974 -0.3112 -0.2559 0.2423
va: 3.6023 0.9760 3.8013 0.9999 3.9330 4.3720 1.0039 0.9988 1.0042 2.1744 3.2452 1.0168 3.8488 1.0114 3.9036 4.2227 1.0258 1.0080 0.9971 2.0370 0.9854 1.0555 3.1787 1.0183 3.8653 1.0060 3.9117 4.2917 1.0104 1.0116 1.0107 2.1598 2.2348 1.0157
dispcorr: -0.065316865 hartree
energy: -819.411238672086
dipole: 11.75250 -8.43595 3.31655 -2.17455 2.69959 0.52504 -0.77991 1.38368 0.60377
magnitude: 3.41170 au
magnitude: 8.67186 debye
zeropoint: 0.29448337 hartree
thermalvibcorrection: 0.01463978 hartree
thermalrotcorrection: 0.00141627 hartree
thermaltrasncorrection: 0.00141627 hartree
thermaltotal: -819.09928297 hartree
thermalcorr: 0.01747233 hartree
nonthermalcorr: 0.29448337 hartree
totalcorr: 0.31195570 hartree
totalenthalpy: -819.09833876 hartree
