program: Orca
programVersion: 5.0.2
elementType: N H C H C C H H H O N H C H C C H H H O H H N H C H C C H H H O O H
charge: 1
multiplicity: 1
keywords: wB97X-D3BJ Opt Freq def2-TZVPP def2/J RIJCOSX VeryTightSCF
keywords: PAL8 defgrid3 VeryTightOpt
frequency: 0.00 0.00 0.00 0.00 0.00 0.00 20.59 40.19 53.34 84.18 106.76 122.79 152.65 160.71 170.32 216.41 232.18 237.02 247.51 261.81 270.46 279.02 322.94 332.32 342.84 373.30 385.50 420.98 454.26 527.38 545.12 590.53 601.52 643.33 670.10 694.51 715.96 762.64 793.74 802.74 822.95 843.72 867.59 926.91 946.22 984.22 992.31 1014.60 1076.38 1087.60 1105.35 1126.59 1129.18 1149.42 1195.03 1202.15 1226.52 1233.85 1299.56 1306.29 1319.21 1339.40 1362.26 1379.18 1394.70 1420.84 1425.36 1445.29 1449.80 1458.30 1493.47 1498.77 1501.97 1505.23 1507.90 1515.60 1518.40 1559.56 1562.16 1648.40 1675.14 1737.34 1806.56 1818.09 3071.37 3076.82 3076.91 3131.97 3139.84 3153.42 3158.28 3159.15 3166.82 3170.39 3183.09 3184.01 3213.00 3322.88 3540.16 3596.14 3642.10 3797.55
frequency: 20.59 40.19 53.34 84.18 106.76 122.79 152.65 160.71 170.32 216.41 232.18 237.02 247.51 261.81 270.46 279.02 322.94 332.32 342.84 373.30 385.50 420.98 454.26 527.38 545.12 590.53 601.52 643.33 670.10 694.51 715.96 762.64 793.74 802.74 822.95 843.72 867.59 926.91 946.22 984.22 992.31 1014.60 1076.38 1087.60 1105.35 1126.59 1129.18 1149.42 1195.03 1202.15 1226.52 1233.85 1299.56 1306.29 1319.21 1339.40 1362.26 1379.18 1394.70 1420.84 1425.36 1445.29 1449.80 1458.30 1493.47 1498.77 1501.97 1505.23 1507.90 1515.60 1518.40 1559.56 1562.16 1648.40 1675.14 1737.34 1806.56 1818.09 3071.37 3076.82 3076.91 3131.97 3139.84 3153.42 3158.28 3159.15 3166.82 3170.39 3183.09 3184.01 3213.00 3322.88 3540.16 3596.14 3642.10 3797.55
formula: C9H18N3O4
InChI: InChI=1S/C9H18N3O4/c1-4(10)7(13)11-5(2)8(14)12-6(3)9(15)16/h4-6,11-12,15H,1-3,10H3
34 atoms
N  -1.977203 -1.051907 1.396785
H  -1.212894 -1.68479 1.113086
C  -2.852637 -0.696785 0.20965
H  -3.261467 -1.631907 -0.169284
C  -3.942745 0.265161 0.639905
C  -1.810701 -0.210579 -0.812113
H  -3.54093 1.143338 1.150679
H  -4.505103 0.596114 -0.233211
H  -4.642117 -0.225069 1.319442
O  -1.225853 -1.033503 -1.481029
N  -1.471114 1.108885 -0.754966
H  -1.981226 1.666436 -0.087668
C  -0.040904 1.406582 -0.752533
H  0.415878 0.800021 -1.529107
C  0.22447 2.886254 -1.007422
C  0.469697 1.029554 0.650492
H  -0.162949 3.165619 -1.986589
H  -0.257442 3.500542 -0.244392
H  1.295431 3.089818 -0.981025
O  -0.263864 1.216758 1.620569
H  -1.502191 -0.200067 1.751479
H  -2.516461 -1.479532 2.147232
N  1.722926 0.544617 0.795996
H  1.945355 0.357208 1.76522
C  2.336913 -0.374657 -0.149093
H  2.344764 0.058256 -1.149222
C  3.775799 -0.676902 0.267484
C  1.515511 -1.665448 -0.202726
H  3.803464 -1.131013 1.260741
H  4.236356 -1.364684 -0.439469
H  4.351686 0.247678 0.288195
O  0.636588 -1.942228 0.584975
O  1.890609 -2.449332 -1.200194
H  1.334285 -3.240634 -1.212276
totalener: -819.34788815 hartree
nucrepener: 1282.46996980 hartree
electener: -2101.81785795 hartree
oneelecener: -3645.93207379 hartree
twoeener: 1544.11421584 hartree
kineticenergy: 815.26502873 hartree
exchangeener: -71.641997358270 hartree
correlationener: -5.226595402227 hartree
xcener: -76.868592760497 hartree
temp: 298.15 k
press: 1.00 atm
thermalcorrenthalpy: 0.00094421 hartree
totalenthalpy: -819.10412987 hartree
totalentropycorr: -0.05718679 hartree
gibbsenthalpy: -819.16131666 hartree
gibbsminuselec: 0.25234536 hartree
totalenthalpy: -819.10543056 hartree
chargesum: 1.0000000
charge: -0.074651 0.250322 -0.003133 0.165551 -0.274305 0.133248 0.095101 0.140376 0.119624 -0.303679 -0.175108 0.177295 0.089630 0.120909 -0.280487 0.174115 0.125710 0.110638 0.107815 -0.406757 0.244193 0.227560 -0.146927 0.180425 0.053781 0.123588 -0.289670 0.344847 0.104900 0.124685 0.125114 -0.400197 -0.229783 0.245271
charge: 0.608190 0.024879 -0.054963 0.044273 0.031171 -0.389048 0.019586 0.039031 0.027620 0.130059 0.331468 -0.025034 -0.110370 0.030744 0.041620 -0.359658 0.027141 0.023993 0.025993 0.071573 0.018252 0.044215 0.341033 -0.000135 -0.122147 0.040333 0.043193 -0.416995 0.021994 0.029235 0.026738 0.093537 0.412144 -0.069665
qa: -0.0747 0.2503 -0.0031 0.1656 -0.2743 0.1332 0.0951 0.1404 0.1196 -0.3037 -0.1751 0.1773 0.0896 0.1209 -0.2805 0.1741 0.1257 0.1106 0.1078 -0.4068 0.2442 0.2276 -0.1469 0.1804 0.0538 0.1236 -0.2897 0.3448 0.1049 0.1247 0.1251 -0.4002 -0.2298 0.2453
va: 3.5871 1.0124 3.8484 1.0025 3.9360 4.3188 1.0095 0.9990 1.0022 2.1951 3.2102 1.0277 3.8088 1.0183 3.9410 4.3034 1.0020 1.0046 1.0067 2.0824 1.0305 0.9739 3.1546 1.0235 3.8753 1.0015 3.9341 4.2460 0.9998 1.0080 1.0005 2.0843 2.2948 1.0143
dispcorr: -0.066201504 hartree
energy: -819.418405147947
dipole: -2.48999 1.15181 -1.33818 5.69143 -6.28402 -0.59259 2.48969 -1.34323 1.14646
magnitude: 1.85910 au
magnitude: 4.72545 debye
zeropoint: 0.29456459 hartree
thermalvibcorrection: 0.01461872 hartree
thermalrotcorrection: 0.00141627 hartree
thermaltrasncorrection: 0.00141627 hartree
thermaltotal: -819.10638929 hartree
thermalcorr: 0.01745127 hartree
nonthermalcorr: 0.29456459 hartree
totalcorr: 0.31201586 hartree
totalenthalpy: -819.10544508 hartree
