program: Orca
programVersion: 5.0.2
elementType: N H C H C C H H H O N H C H C C H H H O H H N H C H C C H H H O O H
charge: 1
multiplicity: 1
keywords: wB97X-D3BJ Opt Freq def2-TZVPP def2/J RIJCOSX VeryTightSCF
keywords: PAL8 defgrid3 VeryTightOpt
frequency: 0.00 0.00 0.00 0.00 0.00 0.00 23.45 58.03 67.58 84.96 102.07 126.87 134.12 173.73 194.25 197.23 212.73 225.19 248.26 251.08 266.03 279.44 298.67 338.94 339.88 385.72 409.50 419.19 445.81 509.40 522.76 549.66 572.14 600.95 612.76 619.21 680.99 745.11 765.27 780.23 793.48 838.41 873.67 938.68 953.36 997.63 1004.97 1006.53 1044.32 1075.49 1126.82 1140.02 1144.58 1152.29 1183.11 1208.02 1239.12 1243.47 1295.12 1327.48 1341.87 1365.74 1380.04 1399.45 1402.78 1426.09 1428.32 1439.16 1442.22 1444.77 1495.93 1498.78 1502.99 1505.74 1510.79 1514.74 1518.87 1522.61 1587.23 1603.04 1683.56 1775.20 1787.61 1796.46 3072.64 3079.88 3086.95 3099.31 3110.18 3128.69 3148.97 3150.48 3168.14 3176.39 3178.21 3214.80 3268.31 3389.13 3561.78 3625.06 3681.10 3822.99
frequency: 23.45 58.03 67.58 84.96 102.07 126.87 134.12 173.73 194.25 197.23 212.73 225.19 248.26 251.08 266.03 279.44 298.67 338.94 339.88 385.72 409.50 419.19 445.81 509.40 522.76 549.66 572.14 600.95 612.76 619.21 680.99 745.11 765.27 780.23 793.48 838.41 873.67 938.68 953.36 997.63 1004.97 1006.53 1044.32 1075.49 1126.82 1140.02 1144.58 1152.29 1183.11 1208.02 1239.12 1243.47 1295.12 1327.48 1341.87 1365.74 1380.04 1399.45 1402.78 1426.09 1428.32 1439.16 1442.22 1444.77 1495.93 1498.78 1502.99 1505.74 1510.79 1514.74 1518.87 1522.61 1587.23 1603.04 1683.56 1775.20 1787.61 1796.46 3072.64 3079.88 3086.95 3099.31 3110.18 3128.69 3148.97 3150.48 3168.14 3176.39 3178.21 3214.80 3268.31 3389.13 3561.78 3625.06 3681.10 3822.99
formula: C9H18N3O4
InChI: InChI=1S/C9H18N3O4/c1-4(10)7(13)11-5(2)8(14)12-6(3)9(15)16/h4-6,11-12,15H,1-3,10H3
34 atoms
N  3.075934 0.787732 -0.598642
H  2.534738 1.513636 -0.09903
C  2.652683 -0.550787 -0.066439
H  3.27464 -1.294354 -0.570485
C  2.837724 -0.619645 1.438523
C  1.227506 -0.70557 -0.632442
H  2.18594 0.088851 1.949064
H  2.628164 -1.628704 1.795378
H  3.874411 -0.409327 1.707754
O  0.978398 -0.181752 -1.70858
N  0.34948 -1.401958 0.092574
H  0.654535 -1.826004 0.951093
C  -0.960949 -1.795126 -0.422932
H  -0.811274 -2.260732 -1.396855
C  -1.591745 -2.800351 0.53847
C  -1.992971 -0.6981 -0.73258
H  -1.768297 -2.353699 1.519142
H  -0.946835 -3.673717 0.653932
H  -2.546764 -3.132675 0.135408
O  -2.74248 -0.928746 -1.654913
H  4.076579 0.950987 -0.520182
H  2.764608 0.818859 -1.578166
N  -2.232772 0.409159 0.053451
H  -3.007323 0.915375 -0.34992
C  -1.440331 1.193162 0.989565
H  -2.10077 2.022507 1.259324
C  -1.050264 0.510622 2.291215
C  -0.275086 1.887523 0.285636
H  -0.331294 -0.288908 2.147157
H  -0.610252 1.239959 2.97169
H  -1.945753 0.100051 2.756524
O  0.886095 1.859364 0.650426
O  -0.688373 2.563011 -0.774446
H  0.056638 2.999355 -1.206376
totalener: -819.33435547 hartree
nucrepener: 1287.32885480 hartree
electener: -2106.66321027 hartree
oneelecener: -3655.76003432 hartree
twoeener: 1549.09682405 hartree
kineticenergy: 815.23731081 hartree
exchangeener: -71.638585765163 hartree
correlationener: -5.226324138855 hartree
xcener: -76.864909904018 hartree
temp: 298.15 k
press: 1.00 atm
thermalcorrenthalpy: 0.00094421 hartree
totalenthalpy: -819.09044630 hartree
totalentropycorr: -0.05742712 hartree
gibbsenthalpy: -819.14787342 hartree
gibbsminuselec: 0.25212373 hartree
totalenthalpy: -819.09170204 hartree
chargesum: 1.0000000
charge: -0.077018 0.239050 0.044007 0.164162 -0.316268 0.156978 0.138915 0.111483 0.116412 -0.366481 -0.163818 0.173424 0.070114 0.136139 -0.303617 0.212691 0.106821 0.110025 0.139263 -0.300070 0.230531 0.234552 -0.228674 0.191068 0.081877 0.130188 -0.300768 0.351923 0.055110 0.126343 0.133484 -0.420344 -0.203955 0.226452
charge: 0.610556 0.006676 -0.054800 0.044852 0.028811 -0.398244 0.023408 0.028330 0.027333 0.099685 0.353965 -0.020791 -0.102406 0.047245 0.036369 -0.371941 0.016372 0.018614 0.037809 0.125007 0.042981 0.039673 0.321538 -0.006356 -0.132055 0.055459 0.028467 -0.398769 -0.003692 0.027164 0.027032 0.103133 0.418402 -0.079826
qa: -0.0770 0.2391 0.0440 0.1642 -0.3163 0.1570 0.1389 0.1115 0.1164 -0.3665 -0.1638 0.1734 0.0701 0.1361 -0.3036 0.2127 0.1068 0.1100 0.1393 -0.3001 0.2305 0.2346 -0.2287 0.1911 0.0819 0.1302 -0.3008 0.3519 0.0551 0.1263 0.1335 -0.4203 -0.2040 0.2265
va: 3.6261 1.0314 3.7609 0.9890 3.9392 4.3219 1.0018 1.0042 1.0069 2.1516 3.2055 1.0115 3.7207 1.0348 3.9029 4.2893 0.9959 0.9998 1.0111 2.2269 0.9748 1.0074 3.0618 1.0175 3.8348 0.9984 3.9189 4.2356 1.0157 1.0086 1.0059 2.0632 2.3142 1.0303
dispcorr: -0.066427926 hartree
energy: -819.404536762330
dipole: 8.01479 -3.88382 4.13097 -5.84959 6.53251 0.68292 11.73112 -10.32196 1.40916
magnitude: 4.41781 au
magnitude: 11.22918 debye
zeropoint: 0.29425897 hartree
thermalvibcorrection: 0.01479812 hartree
thermalrotcorrection: 0.00141627 hartree
thermaltrasncorrection: 0.00141627 hartree
thermaltotal: -819.09264712 hartree
thermalcorr: 0.01763067 hartree
nonthermalcorr: 0.29425897 hartree
totalcorr: 0.31188964 hartree
totalenthalpy: -819.09170292 hartree
