program: Orca
programVersion: 5.0.2
elementType: N H C H C C H H H O N H C H C C H H H O H H N H C H C C H H H O O H
charge: 1
multiplicity: 1
keywords: wB97X-D3BJ Opt Freq def2-TZVPP def2/J RIJCOSX VeryTightSCF
keywords: PAL8 defgrid3 VeryTightOpt
frequency: 0.00 0.00 0.00 0.00 0.00 0.00 23.97 34.60 46.12 50.21 80.18 104.44 132.98 168.23 195.52 203.69 229.20 237.04 245.12 262.78 273.84 299.90 313.18 333.49 365.38 369.83 387.99 419.84 428.93 501.66 580.79 609.16 617.72 631.19 662.77 691.49 714.61 753.14 783.10 795.98 808.46 836.34 876.61 901.07 944.43 987.87 997.50 1023.19 1064.23 1066.81 1114.19 1121.64 1135.53 1149.57 1161.07 1182.51 1210.04 1244.29 1259.68 1313.75 1317.09 1352.70 1373.42 1386.10 1412.11 1419.60 1433.07 1439.25 1442.21 1472.17 1493.18 1497.43 1504.29 1508.01 1509.24 1516.70 1528.19 1535.70 1568.62 1624.16 1683.06 1712.62 1826.80 1867.06 2988.98 3075.72 3085.35 3099.92 3110.04 3128.45 3152.10 3156.63 3164.20 3169.09 3182.96 3195.38 3213.87 3469.15 3556.99 3630.25 3634.34 3799.07
frequency: 23.97 34.60 46.12 50.21 80.18 104.44 132.98 168.23 195.52 203.69 229.20 237.04 245.12 262.78 273.84 299.90 313.18 333.49 365.38 369.83 387.99 419.84 428.93 501.66 580.79 609.16 617.72 631.19 662.77 691.49 714.61 753.14 783.10 795.98 808.46 836.34 876.61 901.07 944.43 987.87 997.50 1023.19 1064.23 1066.81 1114.19 1121.64 1135.53 1149.57 1161.07 1182.51 1210.04 1244.29 1259.68 1313.75 1317.09 1352.70 1373.42 1386.10 1412.11 1419.60 1433.07 1439.25 1442.21 1472.17 1493.18 1497.43 1504.29 1508.01 1509.24 1516.70 1528.19 1535.70 1568.62 1624.16 1683.06 1712.62 1826.80 1867.06 2988.98 3075.72 3085.35 3099.92 3110.04 3128.45 3152.10 3156.63 3164.20 3169.09 3182.96 3195.38 3213.87 3469.15 3556.99 3630.25 3634.34 3799.07
formula: C9H18N3O4
InChI: InChI=1S/C9H18N3O4/c1-4(10)7(13)11-5(2)8(14)12-6(3)9(15)16/h4-6,11-12,15H,1-3,10H3
34 atoms
N  -3.313169 1.037942 -0.788422
H  -3.856713 1.896805 -0.839363
C  -3.305064 0.43218 0.598621
H  -2.922832 1.20436 1.266758
C  -4.691447 -0.030959 0.990904
C  -2.298612 -0.717252 0.378273
H  -5.026826 -0.824812 0.322258
H  -4.666749 -0.430423 2.004928
H  -5.406294 0.794042 0.971199
O  -2.626178 -1.591228 -0.389992
N  -1.074676 -0.566559 0.964886
H  -1.029232 0.203366 1.614249
C  0.172654 -0.726052 0.199348
H  0.975957 -0.847135 0.92257
C  0.179077 -1.926699 -0.745615
C  0.343658 0.577648 -0.600275
H  -0.089135 -2.825163 -0.192043
H  -0.530936 -1.796436 -1.556963
H  1.178348 -2.038694 -1.156977
O  -0.629682 1.043014 -1.209797
H  -2.315622 1.193622 -1.080258
H  -3.708167 0.347427 -1.43073
N  1.519904 1.218609 -0.651162
H  1.496949 2.013042 -1.272683
C  2.726845 1.078034 0.157934
H  3.400344 1.856822 -0.209219
C  2.505458 1.345426 1.649917
C  3.474913 -0.221284 -0.129576
H  1.903734 0.570575 2.125647
H  3.462988 1.383285 2.165428
H  2.004792 2.305849 1.774773
O  3.175121 -1.021284 -0.970599
O  4.549507 -0.329407 0.661831
H  5.026195 -1.133243 0.412887
totalener: -819.33619389 hartree
nucrepener: 1223.03861172 hartree
electener: -2042.37480561 hartree
oneelecener: -3528.00157787 hartree
twoeener: 1485.62677227 hartree
kineticenergy: 815.24344264 hartree
exchangeener: -71.637649067597 hartree
correlationener: -5.224342290793 hartree
xcener: -76.861991358390 hartree
temp: 298.15 k
press: 1.00 atm
thermalcorrenthalpy: 0.00094421 hartree
totalenthalpy: -819.08994719 hartree
totalentropycorr: -0.05783528 hartree
gibbsenthalpy: -819.14778247 hartree
gibbsminuselec: 0.25153325 hartree
chargesum: 1.0000000
charge: -0.065676 0.225615 -0.009244 0.126143 -0.254725 0.161844 0.126594 0.117891 0.106400 -0.311898 -0.173151 0.155431 0.109180 0.115822 -0.287214 0.228976 0.118594 0.112885 0.141735 -0.459919 0.244793 0.231735 -0.134532 0.188607 0.039643 0.119746 -0.283869 0.288921 0.086727 0.135256 0.109039 -0.296973 -0.258539 0.244165
charge: 0.607134 0.039896 -0.062861 0.028118 0.035271 -0.385611 0.029701 0.036586 0.021738 0.142900 0.323550 -0.025300 -0.100879 0.027582 0.043887 -0.331440 0.026413 0.016618 0.018654 0.082461 -0.022203 0.053704 0.364337 -0.000433 -0.114306 0.051262 0.030590 -0.437866 0.008530 0.029440 0.019069 0.139081 0.380263 -0.075883
qa: -0.0657 0.2256 -0.0092 0.1261 -0.2547 0.1618 0.1266 0.1179 0.1064 -0.3119 -0.1732 0.1554 0.1092 0.1158 -0.2872 0.2290 0.1186 0.1129 0.1417 -0.4599 0.2448 0.2317 -0.1345 0.1886 0.0396 0.1197 -0.2839 0.2889 0.0867 0.1353 0.1090 -0.2970 -0.2585 0.2442
va: 3.5953 0.9769 3.9586 1.0036 3.9478 4.3197 1.0126 1.0048 1.0028 2.1959 3.1991 1.0213 3.8131 0.9963 3.9353 4.2687 1.0050 1.0112 1.0108 2.0391 1.0551 0.9900 3.2071 1.0152 3.8263 1.0033 3.9322 4.3093 1.0026 1.0152 1.0026 2.1830 2.2270 1.0144
dispcorr: -0.063839549 hartree
energy: -819.403589406871
dipole: -10.18934 8.00272 -2.18662 3.98563 -1.53621 2.44943 5.54339 -4.68302 0.86037
magnitude: 3.39430 au
magnitude: 8.62762 debye
zeropoint: 0.29429848 hartree
thermalvibcorrection: 0.01478895 hartree
thermalrotcorrection: 0.00141627 hartree
thermaltrasncorrection: 0.00141627 hartree
thermaltotal: -819.09166943 hartree
thermalcorr: 0.01762149 hartree
nonthermalcorr: 0.29429848 hartree
totalcorr: 0.31191997 hartree
totalenthalpy: -819.09072523 hartree
