program: Orca
programVersion: 5.0.2
elementType: N H C H C C H H H O N H C H C C H H H O H H N H C H C C H H H O O H
charge: 1
multiplicity: 1
keywords: wB97X-D3BJ Opt Freq def2-TZVPP def2/J RIJCOSX VeryTightSCF
keywords: PAL8 defgrid3 VeryTightOpt
frequency: 0.00 0.00 0.00 0.00 0.00 0.00 29.35 48.04 59.04 65.89 79.14 83.14 125.52 143.62 172.32 207.65 215.11 235.46 245.91 250.37 268.52 282.77 291.65 304.49 333.43 380.81 419.62 422.31 452.93 471.85 576.27 583.90 609.01 641.94 662.81 686.22 704.54 760.93 765.18 793.53 802.87 850.89 879.92 930.99 956.21 994.61 1005.59 1022.76 1047.07 1073.55 1114.40 1122.30 1131.22 1140.10 1185.69 1213.53 1228.40 1247.08 1307.65 1329.90 1341.58 1361.54 1365.31 1375.10 1380.68 1394.36 1405.53 1433.98 1435.52 1437.33 1451.48 1488.44 1503.99 1505.76 1508.25 1509.84 1510.38 1517.13 1629.30 1644.39 1667.39 1776.39 1810.32 1837.47 2887.59 3064.31 3073.46 3080.71 3127.86 3133.17 3150.41 3151.06 3153.98 3161.61 3165.26 3166.59 3174.56 3512.32 3556.88 3577.03 3614.93 3801.06
frequency: 29.35 48.04 59.04 65.89 79.14 83.14 125.52 143.62 172.32 207.65 215.11 235.46 245.91 250.37 268.52 282.77 291.65 304.49 333.43 380.81 419.62 422.31 452.93 471.85 576.27 583.90 609.01 641.94 662.81 686.22 704.54 760.93 765.18 793.53 802.87 850.89 879.92 930.99 956.21 994.61 1005.59 1022.76 1047.07 1073.55 1114.40 1122.30 1131.22 1140.10 1185.69 1213.53 1228.40 1247.08 1307.65 1329.90 1341.58 1361.54 1365.31 1375.10 1380.68 1394.36 1405.53 1433.98 1435.52 1437.33 1451.48 1488.44 1503.99 1505.76 1508.25 1509.84 1510.38 1517.13 1629.30 1644.39 1667.39 1776.39 1810.32 1837.47 2887.59 3064.31 3073.46 3080.71 3127.86 3133.17 3150.41 3151.06 3153.98 3161.61 3165.26 3166.59 3174.56 3512.32 3556.88 3577.03 3614.93 3801.06
formula: C9H18N3O4
InChI: InChI=1S/C9H18N3O4/c1-4(10)7(13)11-5(2)8(14)12-6(3)9(15)16/h4-6,11-12,15H,1-3,10H3
34 atoms
N  -4.307812 -0.238826 0.546693
H  -4.132729 -0.362687 -0.49307
C  -2.941379 0.167059 1.030127
H  -3.022607 1.154632 1.484178
C  -2.381511 -0.844949 2.017845
C  -2.133965 0.262464 -0.287088
H  -2.301172 -1.832415 1.556085
H  -1.38849 -0.53364 2.344034
H  -3.01602 -0.913248 2.903054
O  -2.70317 -0.069914 -1.324823
N  -0.886402 0.703366 -0.189445
H  -0.52421 0.934077 0.727419
C  -0.04749 0.967516 -1.361173
H  -0.721624 1.06641 -2.209573
C  0.726815 2.271595 -1.166693
C  0.918871 -0.144849 -1.809605
H  0.031139 3.101231 -1.037825
H  1.383776 2.23174 -0.296063
H  1.334434 2.462438 -2.050447
O  1.145232 -0.242582 -2.992519
H  -4.626186 -1.111324 0.962709
H  -5.017273 0.474537 0.696369
N  1.607586 -0.934804 -0.910233
H  2.161545 -1.630114 -1.390128
C  1.325052 -1.190919 0.490984
H  0.272049 -1.419293 0.650982
C  2.163626 -2.376161 0.970309
C  1.634408 0.032326 1.355813
H  3.230518 -2.190705 0.829235
H  1.986292 -2.562493 2.029421
H  1.890743 -3.271478 0.410197
O  0.849733 0.468748 2.163854
O  2.818615 0.609529 1.173185
H  3.27735 0.207405 0.423811
totalener: -819.33096185 hartree
nucrepener: 1245.96096059 hartree
electener: -2065.29192244 hartree
oneelecener: -3572.80474850 hartree
twoeener: 1507.51282606 hartree
kineticenergy: 815.21865221 hartree
exchangeener: -71.631107469394 hartree
correlationener: -5.225508160068 hartree
xcener: -76.856615629462 hartree
temp: 298.15 k
press: 1.00 atm
thermalcorrenthalpy: 0.00094421 hartree
totalenthalpy: -819.08633848 hartree
totalentropycorr: -0.05800645 hartree
gibbsenthalpy: -819.14434493 hartree
gibbsminuselec: 0.25033823 hartree
totalenthalpy: -819.08746105 hartree
chargesum: 1.0000000
charge: -0.055932 0.232121 -0.008479 0.154429 -0.305140 0.264280 0.113830 0.115295 0.136442 -0.359776 -0.234310 0.205081 0.092554 0.135925 -0.295353 0.172055 0.109534 0.109624 0.135862 -0.284083 0.229018 0.236089 -0.257789 0.194027 0.029619 0.079539 -0.280941 0.285253 0.116529 0.118632 0.121626 -0.328122 -0.213511 0.236073
charge: 0.607318 -0.005384 -0.046366 0.039693 0.030459 -0.370643 0.024233 0.029337 0.026341 0.129576 0.362532 -0.024670 -0.096128 0.048545 0.038816 -0.368842 0.021354 0.016213 0.034908 0.130367 0.044802 0.045589 0.306463 -0.010413 -0.150880 0.023696 0.039709 -0.441595 0.020687 0.030918 0.024743 0.117633 0.411296 -0.090309
qa: -0.0559 0.2321 -0.0085 0.1544 -0.3051 0.2643 0.1138 0.1153 0.1364 -0.3598 -0.2343 0.2051 0.0926 0.1359 -0.2954 0.1721 0.1095 0.1096 0.1359 -0.2841 0.2290 0.2361 -0.2578 0.1940 0.0296 0.0795 -0.2809 0.2853 0.1165 0.1186 0.1216 -0.3281 -0.2135 0.2361
va: 3.5843 1.0522 3.8668 0.9955 3.9111 4.1839 0.9919 1.0474 1.0040 2.1664 3.2398 1.0322 3.6417 1.0360 3.9261 4.3439 1.0045 1.0087 1.0072 2.2420 0.9786 0.9748 2.9977 1.0121 3.9431 0.9955 3.9395 4.2433 1.0046 1.0047 0.9987 2.1318 2.2664 1.0183
dispcorr: -0.064285319 hartree
energy: -819.399624724784
dipole: -6.07894 2.05080 -4.02815 -3.28092 2.41770 -0.86322 7.12452 -5.08074 2.04378
magnitude: 4.59871 au
magnitude: 11.68900 debye
zeropoint: 0.29343307 hartree
thermalvibcorrection: 0.01495417 hartree
thermalrotcorrection: 0.00141627 hartree
thermaltrasncorrection: 0.00141627 hartree
thermaltotal: -819.08840494 hartree
thermalcorr: 0.01778671 hartree
nonthermalcorr: 0.29343307 hartree
totalcorr: 0.31121978 hartree
totalenthalpy: -819.08746073 hartree
