program: Gaussian 09
title: 000048425
version: EM64L-G09RevD.01
frameworkgroup: C1[X(C18H24N2O5)]
method: RPBEPBE
basis: SDD
operation: Freq
keyword: #p
keyword: freq=noraman
keyword: PBEPBE/SDD
title: #p freq=noraman PBEPBE/SDD
converged: YES YES NO NO
title: Mulliken charges:
elementType: O O O O O N N C C C C C C C C C C C C C C C C C C H H H H H H H H H H H H H H H H H H H H H H H H
charge: -0.223907 -0.209933 -0.231897 -0.307756 -0.304465 -0.185411 -0.377567 0.103035 -0.412124 -0.399971 0.179227 0.112583 -0.384827 -0.721493 -0.705810 0.190342 -0.552954 0.433681 -0.009301 -0.405579 0.228593 -0.224480 -0.367537 -0.533418 -0.527135 0.227544 0.238882 0.213894 0.250086 0.259496 0.253447 0.363624 0.222497 0.233418 0.229292 0.220591 0.229577 0.250001 0.240892 0.258691 0.246112 0.227147 0.251473 0.242391 0.248244 0.226941 0.219169 0.257821 0.226875
chargesum: 0.00000
title: Mulliken charges with hydrogens summed into heavy atoms:
elementType: O O O O O N N C C C C C C C C C C C C C C C C C C
charge: -0.223907 -0.209933 -0.231897 -0.307756 -0.304465 -0.185411 -0.013943 0.103035 0.054303 0.064008 0.179227 0.112583 0.128116 -0.036287 -0.005642 0.190342 -0.053370 0.433681 -0.009301 -0.159467 0.228593 0.002667 -0.116063 0.184157 0.176731
polarizability: 2.73557347e+02 -6.47310561e+00 2.40438658e+02 -1.45694663e+01 3.66805758e+00 1.57246647e+02
1716.lowfreq: -6.2244 -2.4346 -0.0004 -0.0003 0.0007 11.4947 20.5106 26.6914 29.0349
frequency: 20.4853 26.1951 28.9859 41.1488 52.1117 59.9522 76.3366 82.7026 97.5038 104.4676 114.9734 120.3163 152.6353 153.3729 156.2914 170.4767 177.7287 180.2746 203.7086 216.9432 223.8584 247.9604 261.9865 293.5009 302.8351 324.6647 342.2914 345.4755 348.7760 376.6829 393.9735 407.1142 446.4216 456.8180 468.0611 476.6129 523.8111 547.1853 565.8599 580.7461 604.7459 656.0818 660.5380 663.7507 698.9192 706.8822 721.9940 755.8953 762.0081 773.0205 782.4551 783.6514 792.3925 806.7300 858.8391 897.3877 905.1952 927.1153 941.8784 943.8960 960.0835 971.3784 989.0225 1026.2478 1031.9458 1041.7272 1051.2275 1067.4081 1075.6580 1097.2527 1111.8233 1113.7448 1118.2262 1144.8238 1150.9287 1154.3594 1165.9612 1170.5691 1176.1383 1191.4239 1233.0260 1244.1839 1268.4774 1275.2784 1300.0453 1301.9816 1304.5311 1324.0777 1331.3662 1340.7586 1356.4513 1363.5093 1379.0906 1383.8238 1395.2073 1400.2118 1417.5899 1430.2108 1448.0075 1449.0131 1450.1255 1458.9427 1460.3847 1467.0059 1468.3105 1470.1530 1473.6361 1477.1337 1482.6537 1485.2373 1488.3536 1489.9120 1580.8097 1588.1393 1595.0100 1641.9295 1652.2091 2972.1329 2976.9077 2980.7453 2985.1092 2994.8923 3013.5923 3019.5314 3042.5645 3049.2939 3071.3530 3071.5964 3080.0255 3081.6492 3082.4194 3084.3028 3097.4076 3101.6655 3117.1514 3119.7346 3121.4029 3123.3340 3145.8308 3167.9269 3516.3069
redmass: 4.8364 4.9350 5.0133 5.7333 4.5277 4.4888 2.6847 2.1737 2.7449 2.3221 4.0268 4.7509 2.3791 1.5414 1.3434 3.9369 2.5790 2.2397 2.3997 1.4695 3.0813 2.3237 2.4651 2.2957 2.3112 3.3104 4.5016 5.2144 3.8204 5.7538 5.6557 8.2201 4.9926 4.8048 5.8333 3.9146 5.1060 5.5187 4.2130 5.8410 4.9236 2.9169 3.5797 4.5410 6.7068 4.2351 4.8472 2.1773 1.5083 1.6833 1.3735 3.2902 1.5146 2.0187 2.7150 4.5844 1.4562 3.4152 1.9967 7.7839 2.1923 1.3334 4.1955 3.0609 3.2011 2.8964 1.5296 2.2791 1.8341 2.9169 1.6397 1.4781 1.2488 1.7111 2.2768 1.3768 2.2293 1.5743 2.5603 2.5086 2.0070 2.0196 2.1493 1.2941 1.4844 1.5934 1.6070 1.4947 1.4275 1.7021 1.8459 5.9077 1.9156 1.9078 1.2075 1.2019 1.3438 1.3195 1.2088 1.6505 1.0838 1.1743 1.9311 1.0867 1.0898 1.0708 1.0487 1.0973 1.0517 1.0547 1.0523 1.0417 10.0774 6.9505 6.7582 5.9712 8.4944 1.0316 1.0293 1.0594 1.0359 1.0370 1.0611 1.0615 1.1016 1.0590 1.0995 1.1026 1.1060 1.0987 1.1005 1.0988 1.1022 1.1006 1.1028 1.1060 1.1032 1.0885 1.0916 1.0982 1.0767
irintensity: 0.1006 0.2467 0.0343 0.5747 0.3532 0.1444 11.9890 0.1746 6.0582 0.4514 1.9773 1.1562 4.7941 3.2589 0.8105 4.0894 1.4679 8.9620 0.8803 1.0656 2.0696 3.4719 0.7762 3.1041 8.6315 5.7932 4.4736 10.1118 10.1630 14.0883 9.8089 13.7862 14.3857 2.0323 20.1174 9.1251 2.0883 3.9310 4.3330 0.1403 0.1380 15.2216 5.8735 7.1767 1.8604 6.9010 4.9222 25.8611 8.9954 106.3264 16.2861 13.3142 16.4265 20.2869 11.2946 11.9067 0.7346 5.3261 6.8417 42.4445 18.5253 1.9479 58.6248 19.8465 22.9375 21.5884 6.8083 9.6817 9.2728 14.5200 34.9750 1.7407 4.5603 6.4560 3.5680 1.8560 12.7338 26.5561 42.1634 44.8953 44.3695 31.8185 76.2201 12.2205 16.1745 54.7031 119.2032 100.7101 15.8963 101.7692 118.1048 20.2960 13.0257 141.0029 11.1606 28.8625 8.2303 6.5047 28.0543 72.5168 40.0413 20.0451 11.3396 6.5928 16.3699 8.7569 8.1375 10.4469 6.0443 14.7386 15.0546 13.0344 313.4855 12.5551 6.3259 390.3641 160.1808 86.0483 38.7618 21.2591 21.5836 21.8726 13.6787 16.7764 8.0132 14.7007 6.3978 25.1055 18.9462 40.3856 2.6364 23.0230 31.4262 25.5384 22.3250 1.1396 23.2410 6.7862 13.8410 15.1156 66.3369
temp: 298.150 k
press: 1.00000 atm
elementType: 8 8 8 8 8 7 7 6 6 6 6 6 6 6 6 6 6 6 6 6 6 6 6 6 6 1 1 1 1 1 1 1 1 1 1 1 1 1 1 1 1 1 1 1 1 1 1 1 1
symmnumber: 1
zpe: 1042654.6 jmol-1
zpe.correction: 0.397126 hartree
zpe.thermalcorrener: 0.423453 hartree
zpe.thermalcorrenthalpy: 0.424398 hartree
zpe.thermalcorrgfe: 0.338909 hartree
zpe.sumelectzpe: -1184.066889 hartree
zpe.sumelectthermal: -1184.040562 hartree
zpe.sumelectthermalent: -1184.039618 hartree
zpe.sumelectthermalfe: -1184.125106 hartree
dipole: 0.2579 -1.0171 1.1042
dipole: 1.5232
quadrupole: -152.2839 -146.7441 -147.6258
quadrupole: -1.7032 11.0538 3.2273
quadrupole: -3.3993 2.1405 1.2588 -1.7032 11.0538 3.2273
hfenergy: -1184.4640155 hartree
pointgroup: C01 [X(C18H24N2O5)]
dipole: -0.0933759 0.4217725 0.4153571 debye
polarizability: 274.1359591|-5.843133|239.8325002|12.4857319|-7.7696|157.2741937 unknown
InChI: InChI=1S/C18H24N2O5/c1-5-18(6-2)15(21)19-17(23)20(16(18)22)11-10-12-8-7-9-13(24-3)14(12)25-4/h7-9,19H,5-6,10-11H2,1-4H3
charge 0 multiplicity 1
49 atoms
O  -1.1456 1.456078 0.564655
O  -5.280854 -0.487287 -0.967281
O  -1.564457 -3.134397 -0.156516
O  2.623478 1.382765 -0.852615
O  5.346521 1.401505 0.094595
N  -1.361079 -0.841843 0.307462
N  -3.404759 -1.759137 -0.518669
C  -3.422308 0.631497 0.198026
C  -3.761004 1.957236 -0.540664
C  -4.034593 0.62828 1.669637
C  -1.899669 0.470386 0.338297
C  -4.114601 -0.547542 -0.499401
C  0.0836 -1.025108 0.624162
C  -3.28583 1.998438 -2.008308
C  -3.607963 1.804727 2.568935
C  -2.075132 -1.98516 -0.113762
C  0.977864 -0.978446 -0.645328
C  2.445987 -0.985176 -0.251848
C  3.209781 0.210982 -0.313043
C  3.064713 -2.163315 0.240637
C  4.572113 0.218984 0.105706
C  4.406007 -2.149308 0.680273
C  5.161687 -0.957568 0.614254
C  2.285829 2.425326 0.149122
C  5.58914 1.987182 -1.244854
H  -4.857597 2.088427 -0.499226
H  -3.291688 2.78423 0.018148
H  -3.769816 -0.329835 2.160094
H  -5.133672 0.632197 1.540513
H  0.190612 -1.996928 1.132614
H  0.364815 -0.214546 1.314498
H  -3.892272 -2.581889 -0.889038
H  -3.558008 2.965451 -2.467386
H  -3.758234 1.202344 -2.611361
H  -2.187468 1.897134 -2.079667
H  -4.02638 1.657703 3.581399
H  -3.98751 2.768595 2.189506
H  -2.511236 1.88429 2.65807
H  0.741548 -1.855845 -1.274637
H  0.755036 -0.06035 -1.213949
H  2.485403 -3.093901 0.276643
H  4.867923 -3.06527 1.063971
H  6.20574 -0.917605 0.940644
H  3.162485 2.650189 0.783168
H  1.425157 2.097554 0.760193
H  1.999995 3.312983 -0.436153
H  6.194593 1.291852 -1.857383
H  4.636131 2.209047 -1.756171
H  6.155971 2.912277 -1.059163
