program: Orca
programVersion: 5.0.2
elementType: N H C H C C H H H O N H C H C C H H H O H H N H C H C C H H H O O H
charge: 1
multiplicity: 1
keywords: wB97X-D3BJ Opt Freq def2-TZVPP def2/J RIJCOSX VeryTightSCF
keywords: PAL8 defgrid3 VeryTightOpt
frequency: 0.00 0.00 0.00 0.00 0.00 0.00 28.34 30.20 51.46 79.86 101.04 131.74 154.85 183.69 195.09 204.29 213.61 232.09 240.20 255.81 267.62 289.85 320.76 340.77 362.50 369.96 413.04 426.40 466.88 501.02 516.80 568.99 587.67 596.91 618.52 650.82 691.05 730.63 760.90 764.96 816.80 829.19 905.55 925.61 956.32 980.36 1005.23 1012.45 1054.71 1079.17 1125.69 1138.11 1144.44 1149.14 1181.45 1199.24 1220.44 1226.58 1291.62 1313.30 1358.76 1365.07 1372.37 1385.15 1418.57 1422.59 1432.42 1437.93 1447.84 1455.36 1491.96 1497.83 1500.69 1506.41 1510.33 1517.06 1519.87 1589.67 1594.08 1674.42 1681.79 1762.05 1791.72 1806.43 3081.41 3091.41 3096.88 3102.67 3103.46 3140.56 3160.88 3170.60 3173.68 3175.94 3178.15 3186.32 3195.11 3296.21 3529.64 3620.49 3676.01 3795.27
frequency: 28.34 30.20 51.46 79.86 101.04 131.74 154.85 183.69 195.09 204.29 213.61 232.09 240.20 255.81 267.62 289.85 320.76 340.77 362.50 369.96 413.04 426.40 466.88 501.02 516.80 568.99 587.67 596.91 618.52 650.82 691.05 730.63 760.90 764.96 816.80 829.19 905.55 925.61 956.32 980.36 1005.23 1012.45 1054.71 1079.17 1125.69 1138.11 1144.44 1149.14 1181.45 1199.24 1220.44 1226.58 1291.62 1313.30 1358.76 1365.07 1372.37 1385.15 1418.57 1422.59 1432.42 1437.93 1447.84 1455.36 1491.96 1497.83 1500.69 1506.41 1510.33 1517.06 1519.87 1589.67 1594.08 1674.42 1681.79 1762.05 1791.72 1806.43 3081.41 3091.41 3096.88 3102.67 3103.46 3140.56 3160.88 3170.60 3173.68 3175.94 3178.15 3186.32 3195.11 3296.21 3529.64 3620.49 3676.01 3795.27
formula: C9H18N3O4
InChI: InChI=1S/C9H18N3O4/c1-4(10)7(13)11-5(2)8(14)12-6(3)9(15)16/h4-6,11-12,15H,1-3,10H3
34 atoms
N  0.989135 1.30206 1.023358
H  1.051862 2.036394 1.726645
C  2.256189 1.282068 0.221702
H  2.313386 2.265758 -0.242604
C  3.467817 1.090029 1.125979
C  2.305828 0.337628 -0.993168
H  3.465323 0.119781 1.621258
H  4.367173 1.164522 0.516692
H  3.507651 1.873999 1.885121
O  3.027376 0.715242 -1.889459
N  1.621189 -0.843508 -1.122977
H  1.882161 -1.265997 -2.00216
C  0.954494 -1.747214 -0.179917
H  0.757775 -2.645322 -0.769508
C  1.789151 -2.161637 1.02306
C  -0.420725 -1.196225 0.236358
H  2.763476 -2.517841 0.688936
H  1.936564 -1.349483 1.732894
H  1.286108 -2.963223 1.563473
O  -0.633546 -0.81466 1.38196
H  0.151273 1.490874 0.438914
H  0.75962 0.420624 1.507414
N  -1.333629 -1.127136 -0.747746
H  -1.039937 -1.381181 -1.675345
C  -2.630076 -0.485801 -0.607762
H  -3.119115 -0.565419 -1.582076
C  -3.53514 -1.15086 0.434208
C  -2.473226 1.013522 -0.368767
H  -3.11966 -1.051249 1.434327
H  -4.523868 -0.696644 0.407605
H  -3.631124 -2.209496 0.19462
O  -1.424601 1.619084 -0.288415
O  -3.651932 1.613368 -0.299944
H  -3.519381 2.56431 -0.180977
totalener: -819.34320998 hartree
nucrepener: 1256.12472451 hartree
electener: -2075.46793449 hartree
oneelecener: -3593.15150857 hartree
twoeener: 1517.68357407 hartree
kineticenergy: 815.24399433 hartree
exchangeener: -71.643362603184 hartree
correlationener: -5.225739129963 hartree
xcener: -76.869101733147 hartree
temp: 298.15 k
press: 1.00 atm
thermalcorrenthalpy: 0.00094421 hartree
totalenthalpy: -819.09780428 hartree
totalentropycorr: -0.05739339 hartree
gibbsenthalpy: -819.15519768 hartree
gibbsminuselec: 0.25211705 hartree
totalenthalpy: -819.09878069 hartree
chargesum: 1.0000000
charge: -0.058140 0.221651 -0.030886 0.158256 -0.270875 0.202777 0.109582 0.146545 0.108492 -0.293150 -0.203090 0.196447 -0.019662 0.144358 -0.274001 0.214186 0.133261 0.066813 0.129600 -0.404428 0.236761 0.213071 -0.164812 0.185475 0.070540 0.130123 -0.284098 0.348283 0.123576 0.126784 0.105672 -0.384189 -0.228750 0.243830
charge: 0.602004 0.046835 -0.067600 0.050475 0.039795 -0.379157 0.016497 0.042143 0.022093 0.130458 0.317258 -0.006347 -0.128112 0.045035 0.031613 -0.375155 0.026727 0.003174 0.033183 0.099433 -0.016861 0.001274 0.352501 -0.010975 -0.107582 0.050409 0.042783 -0.391882 0.018947 0.024955 0.022970 0.121004 0.411966 -0.069861
qa: -0.0581 0.2217 -0.0309 0.1583 -0.2709 0.2028 0.1096 0.1465 0.1085 -0.2931 -0.2031 0.1964 -0.0197 0.1444 -0.2740 0.2142 0.1333 0.0668 0.1296 -0.4044 0.2368 0.2131 -0.1648 0.1855 0.0705 0.1301 -0.2841 0.3483 0.1236 0.1268 0.1057 -0.3842 -0.2288 0.2438
va: 3.5681 0.9779 3.8164 1.0140 3.9166 4.3205 1.0018 1.0082 1.0041 2.2295 3.0433 1.0105 3.8326 0.9895 3.9817 4.2167 1.0000 1.0132 1.0095 2.0741 1.0546 1.0513 3.2270 1.0137 3.8293 1.0055 3.9001 4.2163 1.0096 1.0093 1.0062 2.0814 2.2838 1.0154
dispcorr: -0.064810155 hartree
energy: -819.411641999428
dipole: 4.86506 -5.13984 -0.27478 -4.35811 4.62568 0.26756 7.62546 -6.84884 0.77662
magnitude: 0.86616 au
magnitude: 2.20161 debye
zeropoint: 0.29438205 hartree
thermalvibcorrection: 0.01470239 hartree
thermalrotcorrection: 0.00141627 hartree
thermaltrasncorrection: 0.00141627 hartree
thermaltotal: -819.09972501 hartree
thermalcorr: 0.01753493 hartree
nonthermalcorr: 0.29438205 hartree
totalcorr: 0.31191699 hartree
totalenthalpy: -819.09878080 hartree
