program: Orca
programVersion: 5.0.2
elementType: N H C H C C H H H O N H C H C C H H H O H H N H C H C C H H H O O H
charge: 1
multiplicity: 1
keywords: wB97X-D3BJ Opt Freq def2-TZVPP def2/J RIJCOSX VeryTightSCF
keywords: PAL8 defgrid3 VeryTightOpt
frequency: 0.00 0.00 0.00 0.00 0.00 0.00 21.04 28.98 41.29 60.52 66.41 124.62 139.10 155.07 203.05 219.98 228.94 245.49 254.78 288.74 293.28 304.28 315.43 363.70 367.26 393.22 440.13 491.52 494.88 518.78 558.18 574.61 582.11 596.42 602.33 638.38 674.12 730.06 751.92 767.84 813.50 819.66 910.07 932.72 960.98 995.98 1004.12 1020.76 1058.85 1093.82 1127.74 1139.10 1151.71 1165.05 1171.41 1206.75 1226.17 1240.31 1315.57 1333.81 1348.35 1354.86 1358.60 1369.69 1379.51 1415.31 1423.73 1434.34 1437.01 1441.53 1500.67 1501.10 1509.80 1512.84 1513.80 1517.42 1524.47 1550.48 1615.38 1643.74 1703.39 1746.59 1792.12 1853.46 2305.60 3066.98 3074.18 3094.72 3095.95 3103.94 3133.27 3148.17 3152.58 3168.35 3174.75 3193.66 3194.15 3503.22 3568.81 3612.73 3691.54 3802.14
frequency: 21.04 28.98 41.29 60.52 66.41 124.62 139.10 155.07 203.05 219.98 228.94 245.49 254.78 288.74 293.28 304.28 315.43 363.70 367.26 393.22 440.13 491.52 494.88 518.78 558.18 574.61 582.11 596.42 602.33 638.38 674.12 730.06 751.92 767.84 813.50 819.66 910.07 932.72 960.98 995.98 1004.12 1020.76 1058.85 1093.82 1127.74 1139.10 1151.71 1165.05 1171.41 1206.75 1226.17 1240.31 1315.57 1333.81 1348.35 1354.86 1358.60 1369.69 1379.51 1415.31 1423.73 1434.34 1437.01 1441.53 1500.67 1501.10 1509.80 1512.84 1513.80 1517.42 1524.47 1550.48 1615.38 1643.74 1703.39 1746.59 1792.12 1853.46 2305.60 3066.98 3074.18 3094.72 3095.95 3103.94 3133.27 3148.17 3152.58 3168.35 3174.75 3193.66 3194.15 3503.22 3568.81 3612.73 3691.54 3802.14
formula: C9H18N3O4
InChI: InChI=1S/C9H18N3O4/c1-4(10)7(13)11-5(2)8(14)12-6(3)9(15)16/h4-6,11-12,15H,1-3,10H3
34 atoms
N  -1.862983 -1.088284 -1.690801
H  -0.889507 -0.962241 -1.211471
C  -2.901863 -1.165952 -0.611458
H  -3.878633 -1.164145 -1.095125
C  -2.694784 -2.471981 0.15014
C  -2.957206 -0.00032 0.391541
H  -1.707193 -2.497273 0.614024
H  -3.452852 -2.550623 0.925573
H  -2.796406 -3.32748 -0.521413
O  -3.908367 -0.028784 1.139823
N  -2.026512 0.995615 0.511005
H  -2.275692 1.603051 1.279127
C  -0.83548 1.399726 -0.227918
H  -1.001264 1.304135 -1.303418
C  -0.567418 2.873737 0.05039
C  0.335143 0.453442 0.080353
H  -1.419682 3.468526 -0.276865
H  -0.424166 3.059167 1.118564
H  0.311929 3.216428 -0.495743
O  0.271335 -0.7204 -0.319355
H  -1.859128 -1.960573 -2.216673
H  -2.038499 -0.335589 -2.351313
N  1.37136 0.912927 0.769283
H  1.387224 1.891357 0.996109
C  2.615728 0.163943 0.928137
H  3.313852 0.842801 1.424384
C  2.47044 -1.090672 1.78713
C  3.212389 -0.08993 -0.460047
H  1.833454 -1.827484 1.303248
H  3.451432 -1.530614 1.955685
H  2.038401 -0.822708 2.751517
O  2.808189 0.406186 -1.476287
O  4.274307 -0.897029 -0.385125
H  4.64826 -0.985781 -1.27237
totalener: -819.34178786 hartree
nucrepener: 1225.22560773 hartree
electener: -2044.56739558 hartree
oneelecener: -3531.82693821 hartree
twoeener: 1487.25954263 hartree
kineticenergy: 815.22317582 hartree
exchangeener: -71.637207323060 hartree
correlationener: -5.223857275188 hartree
xcener: -76.861064598248 hartree
temp: 298.15 k
press: 1.00 atm
thermalcorrenthalpy: 0.00094421 hartree
totalenthalpy: -819.09602489 hartree
totalentropycorr: -0.05766842 hartree
gibbsenthalpy: -819.15369331 hartree
gibbsminuselec: 0.25028973 hartree
totalenthalpy: -819.09626396 hartree
chargesum: 1.0000000
charge: -0.077097 0.217071 -0.008155 0.151477 -0.281526 0.207366 0.116906 0.145931 0.099835 -0.305516 -0.166364 0.192298 -0.040554 0.113545 -0.342215 0.342750 0.138149 0.106332 0.128722 -0.420156 0.220650 0.205610 -0.140637 0.193605 0.073321 0.119874 -0.282730 0.277506 0.108925 0.127459 0.102246 -0.311262 -0.254867 0.241505
charge: 0.579414 -0.087319 -0.066309 0.044146 0.040910 -0.381003 0.023021 0.039129 0.019317 0.129407 0.326779 -0.000378 -0.126128 0.030311 0.031592 -0.322777 0.031376 0.019378 0.028260 0.172809 0.040137 0.025891 0.377320 -0.010989 -0.099525 0.046276 0.035494 -0.431694 0.015143 0.026760 0.019519 0.116581 0.384261 -0.077108
qa: -0.0771 0.2171 -0.0082 0.1515 -0.2815 0.2074 0.1169 0.1459 0.0998 -0.3055 -0.1664 0.1923 -0.0406 0.1135 -0.3422 0.3427 0.1381 0.1063 0.1287 -0.4202 0.2206 0.2056 -0.1406 0.1936 0.0733 0.1199 -0.2827 0.2775 0.1089 0.1275 0.1022 -0.3113 -0.2549 0.2415
va: 3.5155 1.1166 3.8210 1.0087 3.9190 4.3228 1.0057 1.0127 1.0048 2.2236 3.0581 1.0198 3.8697 0.9956 3.9438 4.0668 1.0014 0.9977 1.0002 2.1037 0.9793 0.9879 3.3170 1.0033 3.7914 1.0052 3.9227 4.3355 1.0126 1.0104 1.0049 2.1881 2.2306 1.0165
dispcorr: -0.062849035 hartree
energy: -819.407943334569
dipole: -4.36619 3.96959 -0.39660 -1.69689 1.75773 0.06084 1.19066 -2.61660 -1.42594
magnitude: 1.48132 au
magnitude: 3.76522 debye
zeropoint: 0.29333105 hartree
thermalvibcorrection: 0.01457297 hartree
thermalrotcorrection: 0.00141627 hartree
thermaltrasncorrection: 0.00141627 hartree
thermaltotal: -819.09720677 hartree
thermalcorr: 0.01740551 hartree
nonthermalcorr: 0.29333105 hartree
totalcorr: 0.31073657 hartree
totalenthalpy: -819.09626256 hartree
