program: Orca
programVersion: 5.0.2
elementType: N H C H C C H H H O N H C H C C H H H O H H N H C H C C H H H O O H
charge: 1
multiplicity: 1
keywords: wB97X-D3BJ Opt Freq def2-TZVPP def2/J RIJCOSX VeryTightSCF
keywords: PAL8 defgrid3 VeryTightOpt
frequency: 0.00 0.00 0.00 0.00 0.00 0.00 28.40 43.97 57.90 72.82 104.39 127.20 135.46 158.06 166.98 202.56 217.09 231.65 238.97 253.91 265.30 286.88 293.24 341.48 349.84 365.84 380.97 419.12 475.15 520.19 559.41 577.13 610.63 624.65 662.72 691.21 716.23 773.70 785.64 799.61 824.43 835.33 896.96 915.48 953.41 984.37 1001.21 1005.94 1043.01 1053.12 1101.30 1110.79 1130.59 1153.48 1167.43 1173.73 1222.54 1272.88 1301.71 1316.55 1337.99 1363.99 1383.86 1391.78 1400.43 1420.20 1431.45 1436.31 1436.73 1452.35 1478.87 1487.02 1492.30 1498.91 1501.10 1512.50 1514.21 1524.79 1588.47 1640.36 1674.56 1748.91 1774.93 1875.35 3080.76 3082.50 3083.69 3108.21 3150.63 3157.66 3160.50 3162.74 3170.09 3171.85 3177.25 3190.16 3200.66 3501.09 3560.92 3609.99 3610.72 3669.35
frequency: 28.40 43.97 57.90 72.82 104.39 127.20 135.46 158.06 166.98 202.56 217.09 231.65 238.97 253.91 265.30 286.88 293.24 341.48 349.84 365.84 380.97 419.12 475.15 520.19 559.41 577.13 610.63 624.65 662.72 691.21 716.23 773.70 785.64 799.61 824.43 835.33 896.96 915.48 953.41 984.37 1001.21 1005.94 1043.01 1053.12 1101.30 1110.79 1130.59 1153.48 1167.43 1173.73 1222.54 1272.88 1301.71 1316.55 1337.99 1363.99 1383.86 1391.78 1400.43 1420.20 1431.45 1436.31 1436.73 1452.35 1478.87 1487.02 1492.30 1498.91 1501.10 1512.50 1514.21 1524.79 1588.47 1640.36 1674.56 1748.91 1774.93 1875.35 3080.76 3082.50 3083.69 3108.21 3150.63 3157.66 3160.50 3162.74 3170.09 3171.85 3177.25 3190.16 3200.66 3501.09 3560.92 3609.99 3610.72 3669.35
formula: C9H18N3O4
InChI: InChI=1S/C9H18N3O4/c1-4(10)7(13)11-5(2)8(14)12-6(3)9(15)16/h4-6,11-12,15H,1-3,10H3
34 atoms
N  -2.902286 1.673089 -1.089671
H  -3.628493 1.644359 -0.343953
C  -1.74266 0.926391 -0.48308
H  -1.198397 0.414206 -1.273086
C  -0.866262 1.924622 0.268168
C  -2.414973 -0.015864 0.527771
H  -1.478038 2.528175 0.942702
H  -0.13695 1.397628 0.877699
H  -0.316755 2.566655 -0.420214
O  -3.49522 0.340125 0.977344
N  -1.760394 -1.10938 0.969305
H  -2.290609 -1.591432 1.682468
C  -0.8030 -1.957986 0.235789
H  -0.505218 -2.719987 0.958801
C  -1.438408 -2.637462 -0.968739
C  0.475179 -1.197729 -0.162459
H  -2.321495 -3.195312 -0.655924
H  -1.725727 -1.90704 -1.725641
H  -0.732968 -3.326553 -1.432296
O  0.668844 -0.881399 -1.332706
H  -2.655978 2.633767 -1.322359
H  -3.275619 1.217572 -1.921195
N  1.324196 -0.912238 0.835509
H  1.071172 -1.195365 1.767269
C  2.623321 -0.23386 0.67216
H  3.029909 -0.140343 1.677118
C  3.59633 -1.020645 -0.200816
C  2.414086 1.22128 0.210641
H  3.21962 -1.168494 -1.211618
H  4.54382 -0.483573 -0.259528
H  3.783043 -1.998364 0.244633
O  2.551496 2.145975 0.960128
O  2.052083 1.401423 -1.066538
H  1.806612 0.545789 -1.462749
totalener: -819.33074293 hartree
nucrepener: 1255.89676281 hartree
electener: -2075.22750574 hartree
oneelecener: -3592.59110686 hartree
twoeener: 1517.36360112 hartree
kineticenergy: 815.22394927 hartree
exchangeener: -71.633402152074 hartree
correlationener: -5.226493743558 hartree
xcener: -76.859895895632 hartree
temp: 298.15 k
press: 1.00 atm
thermalcorrenthalpy: 0.00094421 hartree
totalenthalpy: -819.08649168 hartree
totalentropycorr: -0.05748497 hartree
gibbsenthalpy: -819.14397665 hartree
gibbsminuselec: 0.25178706 hartree
totalenthalpy: -819.08774943 hartree
chargesum: 1.0000000
charge: -0.040880 0.236082 0.003701 0.150417 -0.319501 0.236163 0.152344 0.098251 0.146538 -0.339334 -0.202560 0.204277 0.012034 0.136488 -0.257092 0.218024 0.117975 0.083663 0.125499 -0.417293 0.239650 0.233748 -0.188496 0.196265 0.038328 0.126667 -0.264273 0.223839 0.102047 0.125269 0.103522 -0.264337 -0.251444 0.234418
charge: 0.614589 0.028156 -0.049447 0.024899 0.043546 -0.372195 0.030864 0.030794 0.030672 0.117549 0.339601 0.003462 -0.109853 0.041299 0.032177 -0.379247 0.022993 0.013201 0.032944 0.113799 0.052483 0.052339 0.351923 -0.010353 -0.108481 0.044759 0.032471 -0.452581 0.013927 0.031850 0.021418 0.139701 0.370794 -0.150053
qa: -0.0409 0.2361 0.0037 0.1504 -0.3195 0.2362 0.1523 0.0983 0.1465 -0.3393 -0.2026 0.2043 0.0120 0.1365 -0.2571 0.2180 0.1180 0.0837 0.1255 -0.4173 0.2397 0.2337 -0.1885 0.1963 0.0383 0.1267 -0.2643 0.2238 0.1020 0.1253 0.1035 -0.2643 -0.2514 0.2344
va: 3.6170 1.0270 3.7838 1.0298 3.9037 4.2612 0.9997 1.0375 1.0091 2.1743 3.1562 1.0042 3.8707 0.9923 3.9743 4.1822 1.0029 1.0067 1.0094 2.0710 0.9685 0.9758 3.2306 1.0035 3.8568 1.0086 3.9240 4.3187 1.0144 1.0027 1.0059 2.2303 2.1863 1.0518
dispcorr: -0.065849123 hartree
energy: -819.400656425336
dipole: -2.70192 -0.31683 -3.01875 -4.62066 3.97686 -0.64380 -3.63478 2.79911 -0.83566
magnitude: 3.19776 au
magnitude: 8.12807 debye
zeropoint: 0.29438183 hartree
thermalvibcorrection: 0.01474798 hartree
thermalrotcorrection: 0.00141627 hartree
thermaltrasncorrection: 0.00141627 hartree
thermaltotal: -819.08869407 hartree
thermalcorr: 0.01758052 hartree
nonthermalcorr: 0.29438183 hartree
totalcorr: 0.31196236 hartree
totalenthalpy: -819.08774986 hartree
