program: Orca
programVersion: 5.0.2
elementType: N H C H C C H H H O N H C H C C H H H O H H N H C H C C H H H O O H
charge: 1
multiplicity: 1
keywords: wB97X-D3BJ Opt Freq def2-TZVPP def2/J RIJCOSX VeryTightSCF
keywords: PAL8 defgrid3 VeryTightOpt
frequency: 0.00 0.00 0.00 0.00 0.00 0.00 21.38 25.30 42.49 48.87 66.92 82.83 100.93 160.74 203.35 208.26 231.12 234.86 240.44 254.53 260.96 285.54 313.78 322.14 345.23 366.26 391.57 440.38 469.47 524.72 563.04 568.02 597.61 612.43 632.46 692.55 703.11 750.75 757.81 768.90 797.75 823.99 900.64 939.80 954.29 996.19 1019.20 1032.04 1056.40 1067.45 1124.04 1132.75 1140.73 1156.03 1187.44 1210.39 1215.36 1233.61 1285.09 1330.57 1356.25 1361.23 1377.16 1391.19 1409.14 1413.69 1431.36 1432.05 1432.58 1454.50 1498.12 1502.28 1505.76 1508.62 1510.26 1517.25 1526.18 1602.31 1620.00 1664.46 1689.34 1716.19 1789.06 1880.44 2257.01 3072.60 3082.02 3089.69 3109.46 3137.19 3153.61 3154.35 3163.12 3165.20 3178.55 3181.32 3186.65 3504.78 3565.59 3622.38 3664.31 3798.66
frequency: 21.38 25.30 42.49 48.87 66.92 82.83 100.93 160.74 203.35 208.26 231.12 234.86 240.44 254.53 260.96 285.54 313.78 322.14 345.23 366.26 391.57 440.38 469.47 524.72 563.04 568.02 597.61 612.43 632.46 692.55 703.11 750.75 757.81 768.90 797.75 823.99 900.64 939.80 954.29 996.19 1019.20 1032.04 1056.40 1067.45 1124.04 1132.75 1140.73 1156.03 1187.44 1210.39 1215.36 1233.61 1285.09 1330.57 1356.25 1361.23 1377.16 1391.19 1409.14 1413.69 1431.36 1432.05 1432.58 1454.50 1498.12 1502.28 1505.76 1508.62 1510.26 1517.25 1526.18 1602.31 1620.00 1664.46 1689.34 1716.19 1789.06 1880.44 2257.01 3072.60 3082.02 3089.69 3109.46 3137.19 3153.61 3154.35 3163.12 3165.20 3178.55 3181.32 3186.65 3504.78 3565.59 3622.38 3664.31 3798.66
formula: C9H18N3O4
InChI: InChI=1S/C9H18N3O4/c1-4(10)7(13)11-5(2)8(14)12-6(3)9(15)16/h4-6,11-12,15H,1-3,10H3
34 atoms
N  1.716348 1.919921 -0.166385
H  1.691879 2.612499 -0.9118
C  2.953803 1.064514 -0.294945
H  3.523086 1.476346 -1.1249
C  3.812447 1.135087 0.962669
C  2.726024 -0.388137 -0.75126
H  3.301828 0.737782 1.838511
H  4.717626 0.551348 0.798699
H  4.110751 2.166789 1.16032
O  3.529778 -0.799214 -1.559511
N  1.769039 -1.24371 -0.26888
H  1.870767 -2.129785 -0.742137
C  0.645333 -1.191731 0.659281
H  0.397551 -2.239759 0.835583
C  0.922499 -0.56617 2.02515
C  -0.57048 -0.515571 0.028841
H  1.794046 -1.035392 2.480184
H  1.082063 0.508987 1.96925
H  0.060734 -0.725695 2.674652
O  -0.496145 0.645539 -0.40425
H  0.78261 1.355485 -0.244481
H  1.714858 2.431051 0.713438
N  -1.709237 -1.194385 -0.011159
H  -1.750278 -2.113611 0.397244
C  -2.954843 -0.581255 -0.459413
H  -2.77418 -0.091912 -1.415971
C  -4.03935 -1.644738 -0.6063
C  -3.436634 0.5134 0.48846
H  -4.234774 -2.138621 0.348589
H  -4.961918 -1.176278 -0.945026
H  -3.738813 -2.392185 -1.341394
O  -4.196528 1.374114 0.154373
O  -2.962544 0.374145 1.744152
H  -3.377163 1.065219 2.278535
totalener: -819.33676156 hartree
nucrepener: 1200.66411861 hartree
electener: -2020.00088016 hartree
oneelecener: -3482.47063021 hartree
twoeener: 1462.46975004 hartree
kineticenergy: 815.22189270 hartree
exchangeener: -71.633851169243 hartree
correlationener: -5.221474153808 hartree
xcener: -76.855325323051 hartree
temp: 298.15 k
press: 1.00 atm
thermalcorrenthalpy: 0.00094421 hartree
totalenthalpy: -819.08960046 hartree
totalentropycorr: -0.05837529 hartree
gibbsenthalpy: -819.14797575 hartree
gibbsminuselec: 0.24976401 hartree
totalenthalpy: -819.09123511 hartree
chargesum: 1.0000000
charge: -0.084918 0.227785 -0.020474 0.157591 -0.293354 0.212349 0.112323 0.142095 0.121586 -0.294005 -0.208918 0.193257 0.012797 0.111131 -0.292949 0.315918 0.133022 0.074039 0.131785 -0.414656 0.209986 0.206503 -0.140321 0.183089 0.063255 0.126868 -0.297649 0.267237 0.105253 0.133121 0.120265 -0.264561 -0.286681 0.237231
charge: 0.579319 0.041369 -0.064031 0.046313 0.036358 -0.380253 0.015398 0.042728 0.023919 0.128887 0.326490 -0.001426 -0.126062 0.042038 0.035623 -0.328447 0.027400 0.004918 0.032789 0.175958 -0.097179 0.029882 0.371329 -0.005253 -0.105291 0.046963 0.039882 -0.434021 0.020730 0.036110 0.022167 0.148138 0.349950 -0.082694
qa: -0.0849 0.2278 -0.0205 0.1576 -0.2934 0.2123 0.1123 0.1421 0.1216 -0.2940 -0.2089 0.1933 0.0128 0.1111 -0.2929 0.3159 0.1330 0.0740 0.1318 -0.4147 0.2100 0.2065 -0.1403 0.1831 0.0633 0.1269 -0.2976 0.2672 0.1053 0.1331 0.1203 -0.2646 -0.2867 0.2372
va: 3.5053 0.9786 3.7723 1.0196 3.9076 4.3054 0.9979 1.0068 0.9996 2.2220 3.0702 1.0167 3.8888 1.0021 3.9400 4.1081 0.9983 1.0055 1.0182 2.1153 1.1316 0.9911 3.3134 1.0127 3.7807 1.0223 3.9215 4.3173 0.9997 1.0090 0.9993 2.2537 2.1761 1.0182
dispcorr: -0.062226106 hartree
energy: -819.402918274177
dipole: 6.54103 -5.26297 1.27807 -0.38846 0.88193 0.49347 6.31060 -4.90900 1.40160
magnitude: 1.95996 au
magnitude: 4.98183 debye
zeropoint: 0.29290040 hartree
thermalvibcorrection: 0.01503206 hartree
thermalrotcorrection: 0.00141627 hartree
thermaltrasncorrection: 0.00141627 hartree
thermaltotal: -819.09215327 hartree
thermalcorr: 0.01786461 hartree
nonthermalcorr: 0.29290040 hartree
totalcorr: 0.31076500 hartree
totalenthalpy: -819.09120906 hartree
