program: Orca
programVersion: 5.0.2
elementType: N H C H C C H H H O N H C H C C H H H O H H N H C H C C H H H O O H
charge: 1
multiplicity: 1
keywords: wB97X-D3BJ Opt Freq def2-TZVPP def2/J RIJCOSX VeryTightSCF
keywords: PAL8 defgrid3 VeryTightOpt
frequency: 0.00 0.00 0.00 0.00 0.00 0.00 20.34 42.93 58.74 74.44 92.78 102.37 124.36 144.96 198.99 209.87 219.13 236.49 261.23 269.95 283.96 298.93 319.30 343.56 347.23 373.28 398.74 422.62 468.30 516.20 523.57 544.54 572.06 608.19 630.39 654.60 677.68 740.65 780.52 793.58 804.30 821.97 905.07 923.69 968.38 975.20 994.46 1000.91 1060.05 1089.77 1119.04 1130.40 1141.68 1152.98 1162.28 1200.88 1224.69 1235.83 1308.82 1314.43 1323.25 1349.08 1353.54 1371.86 1388.86 1409.97 1431.70 1434.89 1439.35 1467.01 1470.44 1494.68 1495.00 1499.56 1507.95 1513.05 1518.48 1520.77 1600.24 1617.23 1686.52 1726.66 1799.30 1877.23 3073.55 3075.75 3086.14 3090.46 3100.40 3152.69 3155.33 3164.93 3166.86 3171.28 3185.63 3188.64 3301.89 3432.61 3554.38 3603.84 3701.22 3808.75
frequency: 20.34 42.93 58.74 74.44 92.78 102.37 124.36 144.96 198.99 209.87 219.13 236.49 261.23 269.95 283.96 298.93 319.30 343.56 347.23 373.28 398.74 422.62 468.30 516.20 523.57 544.54 572.06 608.19 630.39 654.60 677.68 740.65 780.52 793.58 804.30 821.97 905.07 923.69 968.38 975.20 994.46 1000.91 1060.05 1089.77 1119.04 1130.40 1141.68 1152.98 1162.28 1200.88 1224.69 1235.83 1308.82 1314.43 1323.25 1349.08 1353.54 1371.86 1388.86 1409.97 1431.70 1434.89 1439.35 1467.01 1470.44 1494.68 1495.00 1499.56 1507.95 1513.05 1518.48 1520.77 1600.24 1617.23 1686.52 1726.66 1799.30 1877.23 3073.55 3075.75 3086.14 3090.46 3100.40 3152.69 3155.33 3164.93 3166.86 3171.28 3185.63 3188.64 3301.89 3432.61 3554.38 3603.84 3701.22 3808.75
formula: C9H18N3O4
InChI: InChI=1S/C9H18N3O4/c1-4(10)7(13)11-5(2)8(14)12-6(3)9(15)16/h4-6,11-12,15H,1-3,10H3
34 atoms
N  1.870947 -2.082275 -0.534457
H  0.901949 -1.810807 -0.767325
C  2.377395 -1.035123 0.415879
H  1.628824 -0.943147 1.196642
C  3.736327 -1.424181 0.972973
C  2.485373 0.203891 -0.485863
H  4.46527 -1.532842 0.169319
H  4.087687 -0.642361 1.646692
H  3.673988 -2.35379 1.542236
O  3.134087 0.081233 -1.50739
N  1.908438 1.365301 -0.099218
H  2.047905 2.104185 -0.775775
C  0.716049 1.487629 0.729291
H  0.8925 0.987094 1.685537
C  0.451056 2.962126 1.008672
C  -0.446568 0.712474 0.073766
H  1.345357 3.418596 1.431782
H  0.187463 3.499827 0.095069
H  -0.349496 3.089145 1.738236
O  -0.230546 -0.374052 -0.46799
H  2.445103 -2.029899 -1.38274
H  1.905938 -3.021932 -0.145391
N  -1.674381 1.222308 0.157369
H  -1.813933 2.105235 0.614181
C  -2.844696 0.505254 -0.351458
H  -3.713946 1.011526 0.076758
C  -2.936932 0.523017 -1.869887
C  -2.895759 -0.917264 0.207283
H  -2.077796 0.021875 -2.312298
H  -3.837944 0.001792 -2.188756
H  -2.979074 1.552659 -2.226261
O  -3.240649 -1.879707 -0.413781
O  -2.575102 -0.951993 1.518186
H  -2.729529 -1.85643 1.820998
totalener: -819.35378703 hartree
nucrepener: 1234.92897890 hartree
electener: -2054.28276593 hartree
oneelecener: -3551.33904518 hartree
twoeener: 1497.05627925 hartree
kineticenergy: 815.25846283 hartree
exchangeener: -71.643128736361 hartree
correlationener: -5.224155330133 hartree
xcener: -76.867284066494 hartree
temp: 298.15 k
press: 1.00 atm
thermalcorrenthalpy: 0.00094421 hartree
totalenthalpy: -819.10673611 hartree
totalentropycorr: -0.05784571 hartree
gibbsenthalpy: -819.16458182 hartree
gibbsminuselec: 0.25183380 hartree
chargesum: 1.0000000
charge: -0.053437 0.257121 -0.000970 0.120603 -0.271957 0.211943 0.132546 0.121172 0.110449 -0.337432 -0.178938 0.186653 0.054611 0.113184 -0.324382 0.345930 0.133981 0.125613 0.096831 -0.509631 0.233632 0.225221 -0.171015 0.189960 0.081189 0.114853 -0.280534 0.265053 0.106044 0.124494 0.098088 -0.273081 -0.280471 0.232675
charge: 0.614997 0.014775 -0.064824 0.026379 0.040378 -0.389669 0.030725 0.036207 0.021865 0.107852 0.338101 0.002296 -0.115042 0.037372 0.030105 -0.351454 0.030961 0.022181 0.020798 0.085632 0.051312 0.044458 0.368244 -0.015944 -0.103900 0.044753 0.034595 -0.433538 0.019256 0.029699 0.016568 0.142311 0.351027 -0.088477
qa: -0.0534 0.2571 -0.0010 0.1206 -0.2720 0.2119 0.1325 0.1212 0.1104 -0.3374 -0.1789 0.1867 0.0546 0.1132 -0.3244 0.3459 0.1340 0.1256 0.0968 -0.5096 0.2336 0.2252 -0.1710 0.1900 0.0812 0.1149 -0.2805 0.2651 0.1060 0.1245 0.0981 -0.2731 -0.2805 0.2327
va: 3.6048 1.0072 3.9429 1.0154 3.9436 4.3040 1.0088 1.0038 1.0020 2.1850 3.1349 1.0176 3.8927 0.9871 3.9507 4.0325 1.0036 0.9959 1.0038 1.9787 1.0001 0.9755 3.3124 1.0075 3.7831 1.0039 3.9590 4.3495 1.0127 1.0096 1.0065 2.2358 2.1918 1.0226
dispcorr: -0.063149508 hartree
energy: -819.420556330341
dipole: 5.91132 -4.48837 1.42295 3.55630 -3.83969 -0.28339 2.79321 -1.34203 1.45118
magnitude: 2.05208 au
magnitude: 5.21596 debye
zeropoint: 0.29433995 hartree
thermalvibcorrection: 0.01479006 hartree
thermalrotcorrection: 0.00141627 hartree
thermaltrasncorrection: 0.00141627 hartree
thermaltotal: -819.10859378 hartree
thermalcorr: 0.01762261 hartree
nonthermalcorr: 0.29433995 hartree
totalcorr: 0.31196255 hartree
totalenthalpy: -819.10764957 hartree
