program: Gaussian 09
title: 000048848
version: EM64L-G09RevD.01
frameworkgroup: C1[X(C16H19I3N2O4)]
method: RPBEPBE
basis: SDD
operation: Freq
keyword: #p
keyword: freq=noraman
keyword: PBEPBE/SDD
title: #p freq=noraman PBEPBE/SDD
converged: NO YES NO NO
title: Mulliken charges:
elementType: I I I O O O O N N C C C C C C C C C C C C C C C C H H H H H H H H H H H H H H H H H H H
charge: 0.161559 0.142202 0.160692 -0.195870 -0.362667 -0.178181 -0.198602 -0.521895 -0.508089 -0.363201 -0.399186 -0.357685 -0.538814 -0.352979 0.223575 -0.696649 0.848875 -0.708547 -0.814887 0.837534 0.693423 -0.811289 -0.021452 0.224376 -0.788268 0.221118 0.193675 0.240039 0.197670 0.189933 0.188637 0.248372 0.212948 0.197934 0.205884 0.208006 0.218339 0.211992 0.317117 0.325052 0.244987 0.241337 0.269768 0.393218
chargesum: 0.00000
title: Mulliken charges with hydrogens summed into heavy atoms:
elementType: I I I O O O O N N C C C C C C C C C C C C C C C C
charge: 0.161559 0.142202 0.160692 -0.195870 0.030551 -0.178181 -0.198602 -0.204779 -0.183037 0.051592 0.038523 0.020885 -0.077493 0.050838 0.223575 -0.058312 0.848875 -0.708547 -0.814887 0.837534 0.693423 -0.811289 -0.021452 0.224376 -0.032176
polarizability: 3.63535116e+02 -3.25710223e+00 3.27768161e+02 -1.51898067e+01 -9.72814468e-01 1.69562754e+02
1716.lowfreq: -48.0805 -15.1086 -6.4433 -2.5196 -0.0004 0.0002 0.0004 5.7338 14.3694
frequency: -48.0567 -10.8881 14.2077 16.3543 27.5256 31.2829 39.8811 42.8786 47.1506 50.7507 59.6248 71.5863 78.2867 93.0811 98.2298 100.6657 112.9585 122.6214 132.9980 152.0446 162.2943 175.2745 198.3866 208.1090 234.1711 237.0129 251.0497 271.6840 290.8979 321.0790 334.6721 351.6054 385.0093 394.6595 416.3699 442.0246 472.7145 479.2889 502.6228 516.0225 544.3838 557.2997 571.7718 621.2081 626.7344 638.5558 640.7369 655.0255 692.8631 713.8415 724.3178 737.8136 764.8010 789.9812 833.3910 869.5768 883.1232 891.9473 915.9203 934.3337 956.2229 964.4050 973.4175 1017.9903 1028.8143 1033.4528 1054.4908 1065.7938 1077.5528 1089.3707 1101.2423 1116.9155 1149.7147 1200.5864 1203.3211 1219.2671 1244.0950 1247.2958 1267.7638 1287.9675 1290.2897 1303.1848 1332.0103 1338.2403 1347.9281 1349.3800 1354.8625 1358.2732 1374.6813 1379.7414 1386.1663 1431.8073 1436.0069 1446.7485 1457.0816 1461.2667 1463.8674 1466.2320 1466.4044 1476.1211 1477.8540 1486.2112 1529.7172 1535.4741 1644.5648 1649.2158 1658.0984 2947.7690 2965.4365 2967.1693 2972.7861 2975.4562 2985.7640 2990.0958 2991.1758 3016.2321 3027.0566 3036.6407 3055.8626 3061.1931 3070.1915 3076.4534 3136.9751 3498.9810 3514.1387 3517.9382
redmass: 1.0458 3.7970 3.9930 5.7090 7.5941 5.4251 8.1636 7.4264 9.9898 10.3101 2.1670 3.1722 6.4876 7.7868 5.5581 13.3190 6.3859 8.9598 2.6915 6.6930 64.7924 3.6472 6.5167 6.9528 1.1877 2.3926 5.3327 5.2515 5.2236 3.4204 4.9482 4.7839 2.6890 3.9202 9.1546 2.6797 1.5621 1.5602 2.2984 3.1123 4.4809 3.9159 3.2050 2.2537 4.6910 5.7585 5.2887 2.9278 3.0528 5.7838 1.2446 5.3547 1.5550 5.3328 1.8115 2.6013 2.1420 3.8240 2.8001 4.1616 1.9418 2.0561 1.9154 5.9020 3.4967 1.6770 3.0759 2.8403 2.5861 1.7197 1.6027 2.4369 2.1688 1.4809 1.5070 2.6629 1.3327 2.2968 1.2903 1.0662 1.1845 7.7135 1.4938 4.0171 1.4715 1.6150 5.0813 1.4585 1.3012 6.4329 1.2200 1.5772 1.8717 1.1094 1.0841 1.0772 1.2501 1.0551 1.0759 1.0494 1.0629 1.0853 10.1064 7.8536 7.0245 10.1158 7.0880 1.0583 1.0554 1.0405 1.0599 1.0599 1.0819 1.0382 1.0802 1.1005 1.1009 1.1017 1.1006 1.1004 1.0994 1.0979 1.0986 1.0639 1.0764 1.0766
irintensity: 0.1632 0.0415 0.2123 0.5381 3.4281 0.1470 5.9855 3.2498 3.9094 0.9521 1.4637 3.5939 2.3015 0.2206 1.5811 0.6798 3.5361 0.3209 0.6437 4.6522 0.1111 3.6101 0.6027 1.5378 0.1780 4.2081 2.8179 2.6243 2.2535 8.6577 6.1056 1.8261 0.0175 2.7843 0.9526 1.2368 40.0148 25.4496 128.1764 42.8378 7.0623 32.2138 28.0737 56.9965 18.6986 6.3456 2.8412 58.6505 1.8350 11.1909 13.9280 36.1290 15.4094 11.4193 7.2851 11.6938 11.8071 22.3495 1.1184 7.8906 3.0014 15.9978 23.2053 36.0228 11.7367 4.2454 92.0573 202.6945 5.6258 8.6308 5.8442 6.4325 79.2350 14.2817 26.5577 155.0013 1.3218 24.2333 5.2295 4.6912 8.0042 0.7174 4.7421 36.7391 3.4295 1.0365 110.9108 27.7917 56.4462 257.5230 10.6145 227.6734 312.0301 23.4051 9.7837 13.5919 76.0999 19.4902 1.1118 7.6642 6.5284 19.4032 43.8575 8.6773 67.5737 228.7453 160.2558 12.0599 22.4746 25.8963 79.5913 16.8628 24.7668 7.3644 12.6731 0.4318 19.3562 86.9910 31.3600 148.8728 48.3361 11.1740 6.5272 40.5436 19.3900 23.3719
temp: 298.150 k
press: 1.00000 atm
elementType: 53 53 53 8 8 8 8 7 7 6 6 6 6 6 6 6 6 6 6 6 6 6 6 6 6 1 1 1 1 1 1 1 1 1 1 1 1 1 1 1 1 1 1 1
symmnumber: 1
zpe: 852657.1 jmol-1
zpe.correction: 0.324760 hartree
zpe.thermalcorrener: 0.352731 hartree
zpe.thermalcorrenthalpy: 0.353675 hartree
zpe.thermalcorrgfe: 0.258754 hartree
zpe.sumelectzpe: -1064.157340 hartree
zpe.sumelectthermal: -1064.129369 hartree
zpe.sumelectthermalent: -1064.128425 hartree
zpe.sumelectthermalfe: -1064.223346 hartree
dipole: -0.4889 -0.9293 -3.7147
dipole: 3.8602
quadrupole: -153.0652 -185.6538 -204.5318
quadrupole: -1.7525 -1.4672 -20.2063
quadrupole: 28.0184 -4.5702 -23.4482 -1.7525 -1.4672 -20.2063
hfenergy: -1064.4821002 hartree
pointgroup: C01 [X(C16H19I3N2O4)]
dipole: -0.2300671 -0.612341 -1.3706335 debye
polarizability: 362.6843708|-7.859033|322.9380152|-17.1879488|-28.0376243|175.2436457 unknown
InChI: InChI=1S/C16H19I3N2O4/c1-3-4-5-6-7-9(23)21-15-12(18)10(16(24)25)11(17)14(13(15)19)20-8(2)22/h20-21,24H,3-7H2,1-2H3
charge 0 multiplicity 1
44 atoms
I  -1.255244 2.882506 -1.58839
I  1.556181 -2.437253 -0.360404
I  -4.510788 -1.875876 0.534268
O  1.309728 2.193101 0.713865
O  -1.399946 -3.602978 1.532214
O  -1.770838 -4.192836 -0.68755
O  -3.153296 2.615181 1.351864
N  1.134608 0.696222 -1.074366
N  -3.759726 1.14518 -0.365671
C  4.615594 1.165871 1.019433
C  4.203152 2.402559 0.184819
C  5.330711 0.052129 0.219476
C  3.15385 2.111321 -0.915509
C  5.772163 -1.134569 1.106889
C  1.803738 1.690938 -0.327565
C  6.474413 -2.256665 0.311922
C  -0.125592 0.140779 -0.723571
C  -1.317623 0.918985 -0.757179
C  -0.229682 -1.238631 -0.392584
C  -2.570126 0.365755 -0.368044
C  -1.472273 -1.836316 -0.082223
C  -2.62436 -1.017952 -0.042057
C  -1.569385 -3.319044 0.180144
C  -4.003582 2.223525 0.515218
C  -5.392598 2.834465 0.353653
H  3.718735 0.746951 1.518544
H  5.287555 1.5051 1.833912
H  3.779424 3.168548 0.860618
H  5.099428 2.844497 -0.294258
H  6.219456 0.476341 -0.294177
H  4.663539 -0.335726 -0.578604
H  2.973024 3.037747 -1.497691
H  3.528918 1.355872 -1.632407
H  6.450907 -0.761099 1.900513
H  4.883573 -1.546058 1.627873
H  5.806355 -2.668268 -0.46968
H  6.778407 -3.091749 0.969537
H  7.382413 -1.876814 -0.193725
H  1.670319 0.221804 -1.805916
H  -4.546885 0.804082 -0.923088
H  -6.174417 2.110442 0.651243
H  -5.581018 3.135707 -0.692587
H  -5.467307 3.719143 1.001938
H  -1.467403 -4.586714 1.680105
