program: Orca
programVersion: 5.0.2
elementType: N H C H C C H H H O N H C H C C H H H O H H N H C H C C H H H O O H
charge: 1
multiplicity: 1
keywords: wB97X-D3BJ Opt Freq def2-TZVPP def2/J RIJCOSX VeryTightSCF
keywords: PAL8 defgrid3 VeryTightOpt
frequency: 0.00 0.00 0.00 0.00 0.00 0.00 14.64 33.60 41.48 67.40 84.72 125.17 129.10 147.78 175.61 197.10 209.17 228.85 263.89 288.26 294.76 307.04 320.89 333.11 350.14 372.89 397.96 434.96 448.63 523.96 537.97 549.04 578.20 584.87 642.83 675.91 700.00 740.99 763.17 786.06 806.69 815.65 896.78 917.17 962.99 980.30 994.34 1010.33 1063.65 1079.83 1117.40 1126.53 1152.43 1162.04 1162.99 1203.38 1215.78 1254.22 1291.02 1317.51 1350.23 1371.85 1381.11 1404.11 1409.50 1412.32 1435.38 1439.64 1444.54 1470.45 1481.30 1498.92 1500.21 1503.73 1516.21 1517.47 1522.78 1529.06 1596.09 1615.28 1687.95 1746.90 1773.15 1858.95 3084.02 3093.01 3093.16 3097.48 3100.00 3123.96 3158.52 3163.73 3172.38 3190.00 3200.34 3203.34 3271.80 3450.27 3558.01 3605.92 3676.64 3801.50
frequency: 14.64 33.60 41.48 67.40 84.72 125.17 129.10 147.78 175.61 197.10 209.17 228.85 263.89 288.26 294.76 307.04 320.89 333.11 350.14 372.89 397.96 434.96 448.63 523.96 537.97 549.04 578.20 584.87 642.83 675.91 700.00 740.99 763.17 786.06 806.69 815.65 896.78 917.17 962.99 980.30 994.34 1010.33 1063.65 1079.83 1117.40 1126.53 1152.43 1162.04 1162.99 1203.38 1215.78 1254.22 1291.02 1317.51 1350.23 1371.85 1381.11 1404.11 1409.50 1412.32 1435.38 1439.64 1444.54 1470.45 1481.30 1498.92 1500.21 1503.73 1516.21 1517.47 1522.78 1529.06 1596.09 1615.28 1687.95 1746.90 1773.15 1858.95 3084.02 3093.01 3093.16 3097.48 3100.00 3123.96 3158.52 3163.73 3172.38 3190.00 3200.34 3203.34 3271.80 3450.27 3558.01 3605.92 3676.64 3801.50
formula: C9H18N3O4
InChI: InChI=1S/C9H18N3O4/c1-4(10)7(13)11-5(2)8(14)12-6(3)9(15)16/h4-6,11-12,15H,1-3,10H3
34 atoms
N  1.906598 -2.292302 -0.375669
H  2.065107 -2.956399 -1.129956
C  2.695011 -1.019853 -0.541304
H  3.745878 -1.308658 -0.489387
C  2.41801 -0.38991 -1.888462
C  2.462921 -0.319985 0.815387
H  3.000376 0.524918 -1.982309
H  2.75283 -1.06368 -2.680619
H  1.364812 -0.170925 -2.044222
O  2.852943 -0.973049 1.767312
N  1.967585 0.935914 0.980964
H  2.035884 1.161577 1.963988
C  0.853166 1.625253 0.329694
H  0.444653 2.25605 1.122808
C  1.241712 2.56554 -0.817151
C  -0.282532 0.659183 -0.042232
H  2.103428 3.159826 -0.514815
H  1.482737 2.038821 -1.735886
H  0.421959 3.250692 -1.036104
O  -0.127658 -0.559621 -0.081844
H  2.168875 -2.706688 0.523423
H  0.914397 -2.003828 -0.328926
N  -1.449975 1.249789 -0.332937
H  -1.530154 2.234057 -0.143901
C  -2.693627 0.502971 -0.48309
H  -3.486185 1.251376 -0.566397
C  -2.733823 -0.372332 -1.733418
C  -2.984837 -0.243478 0.822687
H  -2.009656 -1.181459 -1.669731
H  -3.726808 -0.802238 -1.849433
H  -2.513198 0.237453 -2.609964
O  -2.423165 -0.03381 1.861983
O  -3.983802 -1.121302 0.670565
H  -4.168927 -1.512506 1.535202
totalener: -819.33876763 hartree
nucrepener: 1244.57445715 hartree
electener: -2063.91322479 hartree
oneelecener: -3570.87257938 hartree
twoeener: 1506.95935459 hartree
kineticenergy: 815.24746609 hartree
exchangeener: -71.641566930781 hartree
correlationener: -5.224663463425 hartree
xcener: -76.866230394206 hartree
temp: 298.15 k
press: 1.00 atm
thermalcorrenthalpy: 0.00094421 hartree
totalenthalpy: -819.09210166 hartree
totalentropycorr: -0.05768997 hartree
gibbsenthalpy: -819.14979163 hartree
gibbsminuselec: 0.25243957 hartree
chargesum: 1.0000000
charge: -0.057031 0.223024 0.001923 0.174025 -0.311359 0.201891 0.125506 0.128340 0.106300 -0.336895 -0.185380 0.189728 0.022910 0.129907 -0.262468 0.352719 0.126026 0.096553 0.099542 -0.499108 0.238362 0.247189 -0.183604 0.181502 0.090886 0.117150 -0.287027 0.266859 0.092211 0.129009 0.100814 -0.300152 -0.259693 0.240343
charge: 0.613653 0.042527 -0.060250 0.049663 0.027458 -0.382803 0.033225 0.026195 0.016723 0.105111 0.333294 0.001625 -0.111279 0.046871 0.033310 -0.348510 0.027117 0.010614 0.019396 0.099960 0.051664 0.000896 0.359495 -0.009630 -0.105331 0.046226 0.030153 -0.433501 0.009338 0.026043 0.017856 0.123832 0.377913 -0.078860
qa: -0.0570 0.2230 0.0019 0.1740 -0.3114 0.2019 0.1255 0.1283 0.1063 -0.3369 -0.1854 0.1897 0.0229 0.1299 -0.2625 0.3527 0.1260 0.0966 0.0995 -0.4991 0.2384 0.2472 -0.1836 0.1815 0.0909 0.1171 -0.2870 0.2669 0.0922 0.1290 0.1008 -0.3002 -0.2597 0.2403
va: 3.5985 0.9773 3.8212 0.9978 3.9432 4.3257 0.9966 1.0069 1.0024 2.1647 3.1445 1.0141 3.9433 0.9959 3.9164 4.0595 1.0074 0.9978 1.0131 1.9775 0.9944 1.0223 3.2987 1.0134 3.8010 1.0053 3.9286 4.3462 1.0135 1.0116 1.0060 2.2011 2.2181 1.0173
dispcorr: -0.064035520 hartree
energy: -819.406282606782
dipole: 5.30460 -4.19952 1.10508 2.65339 -3.23813 -0.58474 -13.82920 11.85135 -1.97785
magnitude: 2.33987 au
magnitude: 5.94748 debye
zeropoint: 0.29477757 hartree
thermalvibcorrection: 0.01484835 hartree
thermalrotcorrection: 0.00141627 hartree
thermaltrasncorrection: 0.00141627 hartree
thermaltotal: -819.09382414 hartree
thermalcorr: 0.01768089 hartree
nonthermalcorr: 0.29477757 hartree
totalcorr: 0.31245846 hartree
totalenthalpy: -819.09287993 hartree
