program: Orca
programVersion: 5.0.2
elementType: N H C H C C H H H O N H C H C C H H H O H H N H C H C C H H H O O H
charge: 1
multiplicity: 1
keywords: wB97X-D3BJ Opt Freq def2-TZVPP def2/J RIJCOSX VeryTightSCF
keywords: PAL8 defgrid3 VeryTightOpt
frequency: 0.00 0.00 0.00 0.00 0.00 0.00 18.83 52.28 68.24 74.19 77.78 88.44 112.39 166.29 179.83 232.19 235.59 239.95 258.14 266.46 290.09 291.16 311.22 341.08 368.41 381.89 397.61 417.81 447.60 504.32 529.67 601.23 618.31 641.55 656.57 683.09 729.81 761.87 774.91 789.07 800.09 832.85 862.19 907.19 957.29 978.87 992.64 1003.03 1085.04 1107.24 1121.18 1123.67 1135.23 1161.43 1181.82 1207.16 1224.24 1237.75 1304.28 1318.68 1341.48 1351.15 1367.52 1387.17 1407.51 1434.49 1435.18 1438.68 1460.89 1467.41 1476.65 1494.50 1498.55 1500.12 1504.52 1516.72 1517.26 1522.13 1546.28 1624.19 1686.60 1709.28 1799.48 1859.64 3076.40 3079.34 3088.15 3118.58 3153.97 3155.88 3163.20 3168.54 3171.10 3175.90 3181.29 3187.35 3193.50 3454.71 3544.14 3553.88 3600.23 3795.76
frequency: 18.83 52.28 68.24 74.19 77.78 88.44 112.39 166.29 179.83 232.19 235.59 239.95 258.14 266.46 290.09 291.16 311.22 341.08 368.41 381.89 397.61 417.81 447.60 504.32 529.67 601.23 618.31 641.55 656.57 683.09 729.81 761.87 774.91 789.07 800.09 832.85 862.19 907.19 957.29 978.87 992.64 1003.03 1085.04 1107.24 1121.18 1123.67 1135.23 1161.43 1181.82 1207.16 1224.24 1237.75 1304.28 1318.68 1341.48 1351.15 1367.52 1387.17 1407.51 1434.49 1435.18 1438.68 1460.89 1467.41 1476.65 1494.50 1498.55 1500.12 1504.52 1516.72 1517.26 1522.13 1546.28 1624.19 1686.60 1709.28 1799.48 1859.64 3076.40 3079.34 3088.15 3118.58 3153.97 3155.88 3163.20 3168.54 3171.10 3175.90 3181.29 3187.35 3193.50 3454.71 3544.14 3553.88 3600.23 3795.76
formula: C9H18N3O4
InChI: InChI=1S/C9H18N3O4/c1-4(10)7(13)11-5(2)8(14)12-6(3)9(15)16/h4-6,11-12,15H,1-3,10H3
34 atoms
N  3.371845 -1.05423 1.377143
H  3.95926 -0.962584 2.203174
C  3.356561 0.191891 0.539313
H  2.813613 0.933808 1.116148
C  4.769362 0.648499 0.219113
C  2.621391 -0.254817 -0.734169
H  5.304188 -0.118006 -0.34204
H  4.728039 1.550562 -0.391685
H  5.316998 0.887592 1.132969
O  3.112605 -1.172133 -1.361655
N  1.498068 0.399638 -1.12431
H  1.124692 0.027221 -1.987756
C  0.519122 1.01471 -0.229762
H  1.056315 1.630247 0.492438
C  -0.375388 1.953582 -1.025133
C  -0.079275 -0.104708 0.658074
H  0.254458 2.711821 -1.490672
H  -0.924334 1.445431 -1.817169
H  -1.081462 2.464288 -0.37148
O  0.725874 -0.687043 1.399663
H  2.37973 -1.220231 1.639377
H  3.709106 -1.827536 0.797362
N  -1.364924 -0.451453 0.689355
H  -1.578869 -1.164008 1.380754
C  -2.503799 -0.11717 -0.154313
H  -2.569251 0.954353 -0.320801
C  -2.48822 -0.873566 -1.486745
C  -3.741863 -0.529526 0.636357
H  -2.505908 -1.950175 -1.309787
H  -3.354964 -0.599832 -2.087521
H  -1.586007 -0.638099 -2.051638
O  -3.71245 -1.239716 1.604674
O  -4.851226 -0.02987 0.089879
H  -5.611837 -0.348714 0.595612
totalener: -819.34937029 hartree
nucrepener: 1208.77341397 hartree
electener: -2028.12278427 hartree
oneelecener: -3498.71414576 hartree
twoeener: 1470.59136149 hartree
kineticenergy: 815.93507700 hartree
exchangeener: -71.765454638904 hartree
correlationener: -5.233215793128 hartree
xcener: -76.998670432032 hartree
temp: 298.15 k
press: 1.00 atm
thermalcorrenthalpy: 0.00094421 hartree
totalenthalpy: -819.09908318 hartree
totalentropycorr: -0.06158598 hartree
gibbsenthalpy: -819.16066916 hartree
gibbsminuselec: 0.25155170 hartree
chargesum: 1.0000000
charge: -0.054141 0.224228 -0.008875 0.132179 -0.268476 0.182727 0.131090 0.120744 0.109144 -0.325578 -0.168068 0.185540 0.033511 0.116822 -0.312141 0.282948 0.134164 0.101338 0.114322 -0.479424 0.250745 0.232090 -0.124386 0.194769 0.033479 0.112551 -0.293736 0.313095 0.123758 0.135033 0.082123 -0.300372 -0.258244 0.247040
charge: 0.612735 0.044056 -0.064390 0.025593 0.039927 -0.387166 0.029769 0.036263 0.021844 0.111819 0.335143 -0.002776 -0.114383 0.038377 0.029409 -0.343357 0.030019 0.016373 0.024014 0.066265 -0.007277 0.051234 0.368078 0.002961 -0.111898 0.031669 0.033923 -0.428303 0.027412 0.029511 0.006479 0.133493 0.385964 -0.072780
qa: -0.0541 0.2242 -0.0089 0.1322 -0.2685 0.1827 0.1311 0.1207 0.1091 -0.3256 -0.1681 0.1855 0.0335 0.1168 -0.3121 0.2829 0.1342 0.1013 0.1143 -0.4794 0.2507 0.2321 -0.1244 0.1948 0.0335 0.1126 -0.2937 0.3131 0.1238 0.1350 0.0821 -0.3004 -0.2582 0.2470
va: 3.5906 0.9766 3.9616 1.0067 3.9430 4.3176 1.0103 1.0041 1.0020 2.1975 3.1048 1.0191 3.8283 0.9990 3.9608 4.1781 1.0059 1.0015 0.9962 2.0228 1.0290 0.9954 3.2322 1.0411 3.8526 1.0154 3.9131 4.3243 1.0033 1.0113 1.0063 2.1958 2.2453 1.0119
dispcorr: -0.062850485 hartree
energy: -819.412220851286
dipole: 9.94752 -7.83888 2.10864 6.30761 -5.48753 0.82009 -4.00564 4.70703 0.70139
magnitude: 2.36873 au
magnitude: 6.02082 debye
zeropoint: 0.29470167 hartree
thermalvibcorrection: 0.01465927 hartree
thermalrotcorrection: 0.00141627 hartree
thermaltrasncorrection: 0.00141627 hartree
thermaltotal: -819.10002737 hartree
thermalcorr: 0.01749181 hartree
nonthermalcorr: 0.29470167 hartree
totalcorr: 0.31219348 hartree
totalenthalpy: -819.09908316 hartree
