program: Orca
programVersion: 5.0.2
elementType: N H C H C C H H H O N H C H C C H H H O H H N H C H C C H H H O O H
charge: 1
multiplicity: 1
keywords: wB97X-D3BJ Opt Freq def2-TZVPP def2/J RIJCOSX VeryTightSCF
keywords: PAL8 defgrid3 VeryTightOpt
frequency: 0.00 0.00 0.00 0.00 0.00 0.00 34.64 41.89 59.55 75.65 79.74 88.76 123.27 150.48 166.13 172.81 209.27 213.73 232.49 249.63 257.83 267.31 272.83 283.79 289.68 331.76 395.41 407.55 459.49 506.71 550.60 591.15 608.80 624.14 640.42 658.54 744.53 762.71 777.01 793.46 819.20 851.38 880.88 894.89 955.54 972.15 983.47 1001.43 1057.69 1084.92 1096.95 1111.97 1132.48 1141.59 1208.44 1217.76 1228.41 1232.55 1308.46 1362.93 1367.00 1375.53 1384.43 1406.37 1412.82 1417.49 1425.20 1437.37 1444.08 1447.19 1498.01 1501.51 1503.01 1505.02 1509.71 1512.21 1513.05 1518.75 1537.31 1658.59 1660.89 1770.40 1802.51 1827.16 3076.85 3080.49 3086.33 3089.99 3147.46 3153.69 3157.58 3165.09 3166.51 3171.93 3175.61 3189.03 3441.22 3459.41 3524.55 3529.23 3616.79 3793.23
frequency: 34.64 41.89 59.55 75.65 79.74 88.76 123.27 150.48 166.13 172.81 209.27 213.73 232.49 249.63 257.83 267.31 272.83 283.79 289.68 331.76 395.41 407.55 459.49 506.71 550.60 591.15 608.80 624.14 640.42 658.54 744.53 762.71 777.01 793.46 819.20 851.38 880.88 894.89 955.54 972.15 983.47 1001.43 1057.69 1084.92 1096.95 1111.97 1132.48 1141.59 1208.44 1217.76 1228.41 1232.55 1308.46 1362.93 1367.00 1375.53 1384.43 1406.37 1412.82 1417.49 1425.20 1437.37 1444.08 1447.19 1498.01 1501.51 1503.01 1505.02 1509.71 1512.21 1513.05 1518.75 1537.31 1658.59 1660.89 1770.40 1802.51 1827.16 3076.85 3080.49 3086.33 3089.99 3147.46 3153.69 3157.58 3165.09 3166.51 3171.93 3175.61 3189.03 3441.22 3459.41 3524.55 3529.23 3616.79 3793.23
formula: C9H18N3O4
InChI: InChI=1S/C9H18N3O4/c1-4(10)7(13)11-5(2)8(14)12-6(3)9(15)16/h4-6,11-12,15H,1-3,10H3
34 atoms
N  3.673978 -0.383591 -0.396467
H  4.56941 0.095925 -0.290107
C  2.806647 -0.17804 0.838283
H  3.347969 -0.66529 1.647751
C  2.64777 1.305037 1.13293
C  1.514782 -1.009012 0.697514
H  2.213575 1.871129 0.30913
H  1.99109 1.412084 1.996681
H  3.611107 1.745479 1.398737
O  1.253466 -1.776362 1.597307
N  0.779659 -0.917243 -0.4454
H  -0.013773 -1.557516 -0.456251
C  0.582561 0.285907 -1.24458
H  1.541845 0.762522 -1.457472
C  -0.04768 -0.061321 -2.593401
C  -0.191888 1.444003 -0.58554
H  0.594022 -0.756106 -3.137167
H  -1.020799 -0.531584 -2.465694
H  -0.165078 0.848497 -3.180428
O  0.114852 2.56841 -0.938515
H  3.856552 -1.376515 -0.551486
H  3.216642 -0.01773 -1.232667
N  -1.179323 1.24623 0.329338
H  -1.628061 2.115309 0.582214
C  -1.737351 0.045231 0.952935
H  -0.942058 -0.592337 1.332471
C  -2.626219 0.46586 2.116608
C  -2.492871 -0.790104 -0.077882
H  -3.433758 1.115134 1.77682
H  -3.069447 -0.41138 2.587666
H  -2.029082 0.991587 2.862507
O  -2.015859 -1.760688 -0.619316
O  -3.710488 -0.325794 -0.346031
H  -4.118019 -0.894038 -1.014662
totalener: -819.31140463 hartree
nucrepener: 1260.08578476 hartree
electener: -2079.39718939 hartree
oneelecener: -3601.40344307 hartree
twoeener: 1522.00625368 hartree
kineticenergy: 815.20729760 hartree
exchangeener: -71.623961669873 hartree
correlationener: -5.222512789286 hartree
xcener: -76.846474459158 hartree
temp: 298.15 k
press: 1.00 atm
thermalcorrenthalpy: 0.00094421 hartree
totalenthalpy: -819.06628078 hartree
totalentropycorr: -0.05829386 hartree
gibbsenthalpy: -819.12457464 hartree
gibbsminuselec: 0.25165596 hartree
totalenthalpy: -819.06763380 hartree
chargesum: 1.0000000
charge: -0.050090 0.241329 -0.009919 0.190369 -0.277579 0.153565 0.117083 0.135493 0.129785 -0.272353 -0.236530 0.217720 0.000518 0.063765 -0.264345 0.151560 0.100921 0.121511 0.136521 -0.320544 0.246857 0.231872 -0.172639 0.191437 0.037328 0.115924 -0.284112 0.291542 0.118454 0.114314 0.115600 -0.333317 -0.239984 0.237947
charge: 0.616468 0.060405 -0.048282 0.049558 0.040794 -0.411904 0.023903 0.044021 0.026048 0.135544 0.315189 -0.018986 -0.140686 0.017949 0.043126 -0.394436 0.018636 0.019402 0.032302 0.092641 0.064532 0.044759 0.336607 -0.001089 -0.126285 0.032961 0.035430 -0.425548 0.022116 0.030474 0.021341 0.120935 0.396136 -0.074060
qa: -0.0501 0.2413 -0.0099 0.1904 -0.2776 0.1536 0.1171 0.1355 0.1298 -0.2724 -0.2365 0.2177 0.0005 0.0638 -0.2643 0.1516 0.1009 0.1215 0.1365 -0.3205 0.2469 0.2319 -0.1726 0.1914 0.0373 0.1159 -0.2841 0.2915 0.1185 0.1143 0.1156 -0.3333 -0.2400 0.2379
va: 3.6510 0.9669 3.6880 1.0029 3.9192 4.3201 1.0260 1.0061 1.0016 2.2307 3.0450 1.0386 3.8715 1.0385 3.8890 4.3288 1.0065 1.0176 1.0051 2.2067 0.9650 0.9909 3.1028 1.0182 3.8539 1.0162 3.9440 4.2500 1.0075 1.0049 1.0004 2.1322 2.2676 1.0190
dispcorr: -0.065419089 hartree
energy: -819.380846487806
dipole: 8.66432 -4.71033 3.95398 3.81886 -4.03088 -0.21202 0.40230 -0.88020 -0.47790
magnitude: 3.98840 au
magnitude: 10.13771 debye
zeropoint: 0.29416943 hartree
thermalvibcorrection: 0.01526744 hartree
thermalrotcorrection: 0.00141627 hartree
thermaltrasncorrection: 0.00141627 hartree
thermaltotal: -819.06857707 hartree
thermalcorr: 0.01809998 hartree
nonthermalcorr: 0.29416943 hartree
totalcorr: 0.31226941 hartree
totalenthalpy: -819.06763286 hartree
