program: Orca
programVersion: 5.0.2
elementType: N H C H C C H H H O N H C H C C H H H O H H N H C H C C H H H O O H
charge: 1
multiplicity: 1
keywords: wB97X-D3BJ Opt Freq def2-TZVPP def2/J RIJCOSX VeryTightSCF
keywords: PAL8 defgrid3 VeryTightOpt
frequency: 0.00 0.00 0.00 0.00 0.00 0.00 44.93 60.19 61.44 63.48 76.04 101.36 119.16 144.77 159.78 205.61 228.36 234.25 240.91 245.50 251.42 277.60 289.62 316.16 339.62 382.56 390.38 427.67 436.74 506.98 553.56 604.49 617.62 628.24 650.53 666.85 678.08 738.62 766.71 781.58 803.38 833.62 838.33 903.43 961.74 982.60 997.14 1014.80 1079.14 1080.97 1114.82 1120.07 1123.64 1135.23 1142.73 1180.18 1234.55 1247.47 1283.42 1304.77 1325.92 1334.59 1353.76 1387.45 1398.75 1415.84 1430.57 1433.83 1439.69 1447.72 1476.08 1487.22 1493.56 1499.20 1501.46 1504.23 1513.00 1523.75 1533.79 1607.62 1682.16 1775.71 1821.50 1897.48 3076.13 3078.94 3085.56 3114.76 3117.91 3130.03 3152.23 3161.32 3165.45 3173.72 3176.14 3179.46 3183.22 3477.45 3564.29 3591.79 3623.05 3766.53
frequency: 44.93 60.19 61.44 63.48 76.04 101.36 119.16 144.77 159.78 205.61 228.36 234.25 240.91 245.50 251.42 277.60 289.62 316.16 339.62 382.56 390.38 427.67 436.74 506.98 553.56 604.49 617.62 628.24 650.53 666.85 678.08 738.62 766.71 781.58 803.38 833.62 838.33 903.43 961.74 982.60 997.14 1014.80 1079.14 1080.97 1114.82 1120.07 1123.64 1135.23 1142.73 1180.18 1234.55 1247.47 1283.42 1304.77 1325.92 1334.59 1353.76 1387.45 1398.75 1415.84 1430.57 1433.83 1439.69 1447.72 1476.08 1487.22 1493.56 1499.20 1501.46 1504.23 1513.00 1523.75 1533.79 1607.62 1682.16 1775.71 1821.50 1897.48 3076.13 3078.94 3085.56 3114.76 3117.91 3130.03 3152.23 3161.32 3165.45 3173.72 3176.14 3179.46 3183.22 3477.45 3564.29 3591.79 3623.05 3766.53
formula: C9H18N3O4
InChI: InChI=1S/C9H18N3O4/c1-4(10)7(13)11-5(2)8(14)12-6(3)9(15)16/h4-6,11-12,15H,1-3,10H3
34 atoms
N  2.398538 -2.018656 0.594558
H  3.158896 -2.311185 1.203732
C  2.02232 -0.575655 0.763465
H  1.225337 -0.529005 1.500006
C  3.234788 0.237142 1.195626
C  1.55832 -0.188998 -0.65623
H  4.027806 0.174753 0.447976
H  2.955263 1.28366 1.305581
H  3.614261 -0.10919 2.158757
O  2.005903 -0.863521 -1.57866
N  0.718611 0.832174 -0.819229
H  0.503978 1.041506 -1.786701
C  0.158336 1.742726 0.185887
H  0.306334 1.299737 1.170843
C  0.816296 3.11284 0.12501
C  -1.357533 1.864853 -0.089789
H  1.892428 3.029235 0.282089
H  0.632186 3.575888 -0.843186
H  0.393822 3.765848 0.888132
O  -1.800268 2.853172 -0.625164
H  1.582186 -2.617283 0.729277
H  2.660293 -2.070179 -0.417141
N  -2.163939 0.832153 0.29885
H  -3.117409 0.941761 -0.016038
C  -1.771662 -0.494305 0.705313
H  -0.923099 -0.437116 1.387755
C  -2.929804 -1.181912 1.4353
C  -1.385459 -1.352649 -0.494915
H  -3.797281 -1.254539 0.776614
H  -2.648973 -2.188303 1.745275
H  -3.203408 -0.601658 2.31578
O  -1.796713 -1.218531 -1.605611
O  -0.521091 -2.362366 -0.157032
H  -0.442809 -2.907289 -0.954451
totalener: -819.33137415 hartree
nucrepener: 1268.80945706 hartree
electener: -2088.14083122 hartree
oneelecener: -3617.84689634 hartree
twoeener: 1529.70606513 hartree
kineticenergy: 815.22220763 hartree
exchangeener: -71.629047247577 hartree
correlationener: -5.224412241787 hartree
xcener: -76.853459489364 hartree
temp: 298.15 k
press: 1.00 atm
thermalcorrenthalpy: 0.00094421 hartree
totalenthalpy: -819.08786452 hartree
totalentropycorr: -0.05795992 hartree
gibbsenthalpy: -819.14582443 hartree
gibbsminuselec: 0.25076852 hartree
chargesum: 1.0000000
charge: -0.052415 0.233790 -0.028594 0.130616 -0.283252 0.231656 0.144004 0.119859 0.118817 -0.350937 -0.143385 0.218712 -0.063455 0.107537 -0.243120 0.199831 0.083423 0.131351 0.120246 -0.290944 0.237898 0.231954 -0.170577 0.194623 0.030701 0.076462 -0.289034 0.280501 0.128023 0.105106 0.126210 -0.238597 -0.345869 0.248857
charge: 0.610194 0.044604 -0.063183 0.021135 0.044638 -0.389498 0.034382 0.032577 0.025395 0.109982 0.373319 0.019538 -0.111991 0.022365 0.032627 -0.377999 0.008697 0.029580 0.032140 0.133572 0.038189 0.017814 0.335903 0.000807 -0.147334 0.021474 0.044883 -0.428704 0.028203 0.023197 0.026203 0.167320 0.324971 -0.085000
qa: -0.0524 0.2338 -0.0286 0.1306 -0.2833 0.2317 0.1440 0.1199 0.1188 -0.3509 -0.1434 0.2187 -0.0635 0.1075 -0.2431 0.1998 0.0834 0.1314 0.1202 -0.2909 0.2379 0.2320 -0.1706 0.1946 0.0307 0.0765 -0.2890 0.2805 0.1280 0.1051 0.1262 -0.2386 -0.3459 0.2489
va: 3.6034 0.9728 3.9051 0.9971 3.9326 4.2200 0.9978 1.0074 1.0014 2.1758 3.1612 0.9996 3.8867 0.9932 3.9808 4.3015 1.0014 1.0137 1.0055 2.2252 0.9926 1.0394 3.1440 1.0179 3.9050 1.0052 3.9322 4.2311 1.0005 1.0072 1.0029 2.2788 2.1163 1.0066
dispcorr: -0.065733392 hartree
energy: -819.401377256690
dipole: 8.78897 -5.75398 3.03499 -0.50431 -2.12005 -2.62436 12.00341 -9.27377 2.72964
magnitude: 4.85277 au
magnitude: 12.33475 debye
zeropoint: 0.29337264 hartree
thermalvibcorrection: 0.01498373 hartree
thermalrotcorrection: 0.00141627 hartree
thermaltrasncorrection: 0.00141627 hartree
thermaltotal: -819.09018835 hartree
thermalcorr: 0.01781627 hartree
nonthermalcorr: 0.29337264 hartree
totalcorr: 0.31118891 hartree
totalenthalpy: -819.08924414 hartree
