program: Orca
programVersion: 5.0.2
elementType: N H C H C C H H H O N H C H C C H H H O H H N H C H C C H H H O O H
charge: 1
multiplicity: 1
keywords: wB97X-D3BJ Opt Freq def2-TZVPP def2/J RIJCOSX VeryTightSCF
keywords: PAL8 defgrid3 VeryTightOpt
frequency: 0.00 0.00 0.00 0.00 0.00 0.00 20.16 50.23 54.43 82.16 101.25 132.37 150.59 167.28 189.10 204.26 218.89 233.10 251.87 264.85 271.88 306.44 323.50 336.16 352.43 377.02 429.59 445.59 456.89 520.26 566.32 608.42 622.01 626.21 634.67 663.74 675.03 715.81 765.96 776.50 793.23 842.77 851.28 920.64 978.71 1008.18 1012.15 1034.11 1058.18 1082.30 1119.66 1123.92 1142.04 1157.98 1198.86 1207.34 1240.76 1249.07 1304.46 1315.28 1344.25 1371.65 1372.25 1421.74 1423.17 1428.37 1437.65 1439.95 1447.20 1458.39 1489.58 1492.63 1501.76 1505.42 1505.83 1518.45 1521.14 1534.49 1562.23 1655.47 1705.11 1755.03 1788.82 1802.59 3077.00 3082.93 3092.11 3103.43 3136.09 3141.99 3150.14 3160.32 3161.92 3163.46 3182.93 3184.04 3210.36 3233.78 3540.02 3605.66 3617.77 3782.09
frequency: 20.16 50.23 54.43 82.16 101.25 132.37 150.59 167.28 189.10 204.26 218.89 233.10 251.87 264.85 271.88 306.44 323.50 336.16 352.43 377.02 429.59 445.59 456.89 520.26 566.32 608.42 622.01 626.21 634.67 663.74 675.03 715.81 765.96 776.50 793.23 842.77 851.28 920.64 978.71 1008.18 1012.15 1034.11 1058.18 1082.30 1119.66 1123.92 1142.04 1157.98 1198.86 1207.34 1240.76 1249.07 1304.46 1315.28 1344.25 1371.65 1372.25 1421.74 1423.17 1428.37 1437.65 1439.95 1447.20 1458.39 1489.58 1492.63 1501.76 1505.42 1505.83 1518.45 1521.14 1534.49 1562.23 1655.47 1705.11 1755.03 1788.82 1802.59 3077.00 3082.93 3092.11 3103.43 3136.09 3141.99 3150.14 3160.32 3161.92 3163.46 3182.93 3184.04 3210.36 3233.78 3540.02 3605.66 3617.77 3782.09
formula: C9H18N3O4
InChI: InChI=1S/C9H18N3O4/c1-4(10)7(13)11-5(2)8(14)12-6(3)9(15)16/h4-6,11-12,15H,1-3,10H3
34 atoms
N  -1.193462 0.420759 -1.84851
H  -1.560285 0.720114 -2.749498
C  -2.108599 0.900531 -0.7508
H  -2.37215 1.921678 -1.018353
C  -3.364482 0.041014 -0.716807
C  -1.435503 1.12064 0.624922
H  -3.125087 -1.017612 -0.630611
H  -3.987866 0.340091 0.125271
H  -3.943189 0.190181 -1.630282
O  -1.662835 2.193711 1.139582
N  -0.604423 0.234799 1.271737
H  -0.364188 0.631024 2.170175
C  -0.408218 -1.218188 1.198065
H  0.424012 -1.410174 1.878309
C  -1.590853 -2.050305 1.670784
C  0.060789 -1.604481 -0.20182
H  -1.856744 -1.754022 2.686009
H  -2.459664 -1.928819 1.03109
H  -1.324223 -3.107642 1.675108
O  -0.698337 -2.150181 -0.998163
H  -0.234483 0.804413 -1.72777
H  -1.129247 -0.611105 -1.84383
N  1.317876 -1.268703 -0.566768
H  1.57013 -1.56088 -1.500395
C  2.250587 -0.399967 0.121313
H  2.178026 -0.546646 1.19854
C  3.682441 -0.707686 -0.324496
C  1.933115 1.065581 -0.163551
H  3.792721 -0.551851 -1.400143
H  4.387247 -0.058575 0.192217
H  3.922715 -1.744575 -0.091694
O  1.232321 1.462096 -1.071735
O  2.550036 1.87342 0.681775
H  2.351619 2.793171 0.452311
totalener: -819.33877995 hartree
nucrepener: 1286.24660746 hartree
electener: -2105.58538741 hartree
oneelecener: -3652.75469383 hartree
twoeener: 1547.16930642 hartree
kineticenergy: 815.24650084 hartree
exchangeener: -71.640640788421 hartree
correlationener: -5.227481751322 hartree
xcener: -76.868122539743 hartree
temp: 298.15 k
press: 1.00 atm
thermalcorrenthalpy: 0.00094421 hartree
totalenthalpy: -819.09561180 hartree
totalentropycorr: -0.05708130 hartree
gibbsenthalpy: -819.15269310 hartree
gibbsminuselec: 0.25251323 hartree
chargesum: 1.0000000
charge: -0.076475 0.227280 0.028495 0.160812 -0.307483 0.161649 0.110664 0.141129 0.124074 -0.281045 -0.216653 0.193587 0.048796 0.127533 -0.262313 0.122260 0.117745 0.098297 0.116710 -0.362980 0.225176 0.225054 -0.153238 0.195567 0.048756 0.113437 -0.280489 0.329100 0.109746 0.127782 0.128973 -0.368278 -0.228414 0.254747
charge: 0.602191 0.044797 -0.058299 0.048113 0.036877 -0.378591 0.014414 0.038971 0.026008 0.131681 0.318544 -0.005337 -0.127685 0.039355 0.038985 -0.369128 0.024471 0.013448 0.031060 0.098330 -0.025620 -0.004726 0.351986 -0.001199 -0.124203 0.039487 0.046999 -0.415553 0.023339 0.030885 0.027733 0.132819 0.413687 -0.063839
qa: -0.0765 0.2273 0.0285 0.1608 -0.3075 0.1616 0.1107 0.1411 0.1241 -0.2810 -0.2167 0.1936 0.0488 0.1275 -0.2623 0.1223 0.1177 0.0983 0.1167 -0.3630 0.2252 0.2251 -0.1532 0.1956 0.0488 0.1134 -0.2805 0.3291 0.1097 0.1278 0.1290 -0.3683 -0.2284 0.2547
va: 3.5536 0.9733 3.7350 1.0196 3.9249 4.3412 1.0101 1.0000 1.0032 2.2291 2.9881 1.0135 3.8474 0.9867 3.9777 4.2858 1.0020 1.0052 1.0082 2.1144 1.0689 1.0441 3.1595 1.0138 3.8683 1.0081 3.9179 4.2399 0.9993 1.0075 1.0004 2.1108 2.3035 1.0049
dispcorr: -0.067107465 hartree
energy: -819.409553667186
dipole: -3.51626 3.93613 0.41987 -6.72978 6.50493 -0.22485 -0.85161 -0.22396 -1.07558
magnitude: 1.17631 au
magnitude: 2.98995 debye
zeropoint: 0.29466981 hartree
thermalvibcorrection: 0.01451650 hartree
thermalrotcorrection: 0.00141627 hartree
thermaltrasncorrection: 0.00141627 hartree
thermaltotal: -819.09753481 hartree
thermalcorr: 0.01734905 hartree
nonthermalcorr: 0.29466981 hartree
totalcorr: 0.31201886 hartree
totalenthalpy: -819.09659060 hartree
